{"text_format":"1","workbook":"xlsx","n_sheets":8,"sheets":["Sight1","Sight2","Sight3","LOP plot","data","CALC1","CALC2","CALC3"],"not_rendered":{"charts":10,"images":6,"macros":1,"external_links":0,"defined_names":258,"comments":7,"pivot_tables":0},"unopened":[],"bounds":{"document_bytes":16777216,"sheet_cells":100000,"rows_first":2000,"rows_last":500,"rows_between":2000,"halvings":0,"cell_chars":16384,"cell_head_chars":4096},"cells_cut":0,"cells_raw":0,"read":"whole","date_system":"1900"}

{"sheet":"Sight1","index":0,"n_rows":81,"n_cols":30,"rows_kept":81,"cut":false,"hidden":false,"merged":[]}
["PROGRAM FOR ASTRONOMICAL"]
["SIGHT REDUCTION"]
[]
["Assumed Position (AP)"]
[null,null,"(deg)","(min)","(decimal)"]
["LAT: (N, S)","N",47,0,{"$f":"IF(OR(LEFT(B6,1)=\"S\",LEFT(B6,1)=\"s\"),-(C6+D6/60),C6+D6/60)","v":47}]
["LON: (E, W)","W",71,8.4,{"$f":"IF(OR(LEFT(B7,1)=\"E\",LEFT(B7,1)=\"e\"),-(C7+D7/60),C7+D7/60)","v":71.14}]
[]
["Time of observation"]
["Date:","1987-07-28"]
[null,null,"(hours)","(min)","(sec)"]
["WT",null,22,50,48,{"$f":"TIME(C12,D12,E12)","v":0.95194444444444448}]
["WE: (f, s)","f",null,0,4,{"$f":"IF(OR(LEFT(B13,1)=\"F\",LEFT(B13,1)=\"f\"),-TIME(,D13,E13),TIME(,D13,E13))","v":-4.6296296296296294E-5}]
["ZT",null,{"$f":"HOUR(F14)","v":22},{"$f":"MINUTE(F14)","v":50},{"$f":"SECOND(F14)","v":44},{"$f":"SUM(F12:F13)","v":0.95189814814814822}]
["ZD: (E, W)","W",4,null,null,{"$f":"IF(OR(LEFT(B15,1)=\"E\",LEFT(B15,1)=\"e\"),-TIME(C15,,),TIME(C15,,))","v":0.16666666666666666}]
["UT:",null,{"$f":"IF(F16<0,23-HOUR(-F16),HOUR(F16))","v":2},{"$f":"IF(F16<0,59-MINUTE(-F16),MINUTE(F16))","v":50},{"$f":"IF(F16<0,60-SECOND(-F16),SECOND(F16))","v":44},{"$f":"SUM(F14:F15)","v":1.1185648148148148},{"$f":"(min1_/60)+(sec1_/3600)","v":0.84555555555555562}]
["UT Date",{"$f":"IF(F16>=1,VALUE(B10)+1,IF(F16<0,VALUE(B10)-1,VALUE(B10)))","v":"1987-07-29"}]
[]
["Observed celestial body",null,null,null,"Click here for Nautical Almanac"]
["Name:","Arcturus",null,null,"Star/Sun-Planet/Moon:",null,1]
[null,null,"(deg)","(min)","(decimal)"]
["Dec: (N, S)","N",19,14.9,{"$f":"IF(OR(LEFT(B22,1)=\"S\",LEFT(B22,1)=\"s\"),-(C22+D22/60),C22+D22/60)","v":19.248333333333335},"declination"]
["d: (+, -)",0,null,{"$f":"IF(OR(B22=\"S\",B22=\"s\"),-d_corr1_*60,d_corr1_*60)","v":0},{"$f":"IF(OR(LEFT(B22,1)=\"S\",LEFT(B22,1)=\"s\"),-(d1_*min_sec1/60),d1_*min_sec1/60)","v":0},"declination corr."]
["Corr. Dec.:",{"$f":"B22","v":"N"},{"$f":"ABS(ROUNDDOWN(E24,0))","v":19},{"$f":"(ABS(E24)-C24)*60","v":14.900000000000091},{"$f":"tab_DEC1+d_corr1_","v":19.248333333333335},"corrected dec."]
[]
["SHA:",null,146,13.5,{"$f":"C26+D26/60","v":146.22499999999999},"0 if not star"]
["GHAg (UT hours):",null,336,11.8,{"$f":"C27+D27/60","v":336.19666666666666},"GHA Aries or others"]
["UT min-sec incr:",null,{"$f":"ROUNDDOWN(minsec_corr1,0)","v":12},{"$f":"(minsec_corr1-C28)*60","v":43.113890580000067},{"$f":"IF(G20=1,min_sec1*15.0416667,IF(G20=2,min_sec1*15,IF(G20=3,min_sec1*14.316667,)))","v":12.718564843000001},"min-sec incr (calculated)"]
["v: (+, -)",0,null,{"$f":"v_corr1*60","v":0},{"$f":"v1_*min_sec1/60","v":0},"GHA corr for planets"]
["GHAy",null,{"$f":"ROUNDDOWN(GHAy1,0)","v":348},{"$f":"(GHAy1-C30)*60","v":54.913890580000952},{"$f":"SUM(E27:E29)","v":348.91523150966668},"GHA Aries or others"]
["LHAy",null,null,null,{"$f":"GHAy1-LON1_","v":277.7752315096667},"LHA Aries",null,null,null,null,null,null,null,null,null,null,null,null,"CONVERTER dd.mm.ss to decimal "]
["GHA=GHAy+SHA",null,null,null,{"$f":"SUM(E26:E29)","v":495.14023150966665},null,null,null,null,null,null,null,null,null,null,null,null,null,"Deg","min","sec"]
["GHA corrected:",null,{"$f":"ROUNDDOWN(E33,0)","v":135},{"$f":"(E33-C33)*60","v":8.4138905799989061},{"$f":"IF(GHAo1_>=360,(GHAo1_-360),GHAo1_)","v":135.14023150966665},"Note for midday sights",null,null,null,null,null,null,null,null,null,null,null,null,148,36.799999999999997,0]
[null,null,null,null,null,null,null,null,null,null,null,null,null,null,null,null,null,null,"Decimal:",{"$f":"S33+(T33/60)+(U33/3600)","v":148.61333333333334}]
["LHA=GHA-LON:",null,null,null,{"$f":"GHA1_-LON1_","v":64.000231509666648}]
["LHA corrected:",null,{"$f":"ROUNDDOWN(E36,0)","v":64},{"$f":"(E36-C36)*60","v":1.3890579998871999E-2},{"$f":"IF(LHAo1_>=360,LHAo1_-360,(IF(LHAo1_<0,360+LHAo1_,LHAo1_)))","v":64.000231509666648},null,null,null,null,null,null,null,null,null,null,null,null,null,"CONVERTER decimal to dd.mm.ss"]
[null,null,null,null,null,null,null,null,null,null,null,null,null,null,null,null,null,null,"Decimal:",0.99829999999999997]
["Sextant observed altitude",null,null,null,null,null,null,null,null,null,null,null,null,null,null,null,null,null,"Deg","min","sec"]
["Hs:",null,31,43.75,{"$f":"C39+(D39/60)","v":31.729166666666668},"measured altitude",null,null,null,null,null,null,null,null,null,null,null,null,{"$f":"ROUNDDOWN(T37,0)","v":0},{"$f":"ROUNDDOWN(60*(T37-ROUNDDOWN(T37,0)),0)","v":59},{"$f":"60*(60*(T37-ROUNDDOWN(T37,0))-T39)","v":53.879999999999768}]
["index corr.: (+, -)",null,null,0.3,{"$f":"D40/60","v":5.0000000000000001E-3},"sextant 0° correction"]
["H.eye (ft,m):","ft",null,null,null,null,null,null,null,null,null,null,null,null,null,null,null,null,"GHA INTERPOLATOR for UT min and sec increment"]
[null,0,null,{"$f":"IF(B41=\"ft\",-0.97*SQRT(B42),IF(B41=\"m\",-1.76*SQRT(B42),))","v":0},{"$f":"D42/60","v":0},"height of eye correction",null,null,null,null,null,null,null,null,null,null,null,null,null,null,"deg","min","decimal"]
["Dip short of horizon:",null,null,0,{"$f":"D43/60","v":0},"when using shoreline horizon",null,null,null,null,null,null,null,null,null,null,null,null,"UT 1st hour GHA: ",null,336,11.8,{"$f":"U43+V43/60","v":336.19666666666666}]
["Ha:",null,{"$f":"ROUNDDOWN(E44,0)","v":31},{"$f":"(E44-C44)*60","v":44.050000000000011},{"$f":"SUM(E39:E43)","v":31.734166666666667},null,null,null,null,null,null,null,null,null,null,null,null,null,"UT 2nd hour GHA: ",null,351,14.2,{"$f":"U44+V44/60","v":351.23666666666668},null,null,null,null,null,null,{"$f":"(W44-W43)*AC44","v":0}]
["Alt corr:",null,null,{"$f":"IF(Ha1_<15,-(34.133+4.197*Ha1_+0.00428*Ha1_^2)/(1+0.505*Ha1_+0.0845*Ha1_^2),-(0.97127/TAN(RADIANS(Ha1_))-(0.00137/(TAN(RADIANS(Ha1_)))^3)))","v":-1.564732494412401},{"$f":"D45/60","v":-2.6078874906873349E-2},"refraction correction"]
["Additional correction for non-std temperature and pressure",null,null,null,null,"supp refraction corr",null,null,null,null,null,null,null,null,null,null,null,null,null,null,"min","sec","decimal"]
["Temp (°C):",10,null,null,null,"f factor:",{"$f":"(Press_mb1/1010)*(283/(273+Temp_C1))","v":1},null,null,null,null,null,null,null,null,null,null,null,"UT min-sec incr:",null,{"$f":"min1_","v":50},{"$f":"sec1_","v":44},{"$f":"U47/60+V47/3600","v":0.84555555555555562}]
["Press. (mb):",1010]
["Add'l corr:",null,null,{"$f":"std_hcorr1*(f1_-1)","v":0},{"$f":"TP_corr1/60","v":0},null,null,null,null,null,null,null,null,null,null,null,null,null,null,null,"deg","min","decimal"]
[null,null,null,null,null,null,null,null,null,null,null,null,null,null,null,null,null,null,"GHA increment:",null,{"$f":"ROUNDDOWN(W50,0)","v":12},{"$f":"(W50-U50)*60","v":43.029333333334385},{"$f":"(W44-W43)*W47","v":12.717155555555573}]
["Special corrections (Sun/Moon/March/Venus)"]
[null,"Limb","S.D.",null,null,null,null,null,null,null,null,null,null,null,null,null,null,null,"DIP-SHORT-OF-HORIZON CALCULATOR"]
["Sun:","L",0,{"$f":"IF(B53=\"L\",IF(C53>0,(C53+0.14657*COS(RADIANS(Ha1_+Alt_corr1+tem_press1))),),IF(B53=\"U\",IF(C53>0,(-C53+0.14657*COS(RADIANS(Ha1_+Alt_corr1+tem_press1))),)))","v":0},{"$f":"D53/60","v":0},"for Sun sight",null,null,null,null,null,null,null,null,null,null,null,null,"Height:","ft",10]
["Moon:","L",0,{"$f":"IF(B54=\"L\",C54,IF(B54=\"U\",-C54,0))","v":0},{"$f":"D54/60","v":0},"for Moon sight",null,null,null,null,null,null,null,null,null,null,null,null,"Dist. to horiz (nmi):",null,3.6]
["Moon HP:",0,null,{"$f":"B55*COS(RADIANS(Ha1_+Alt_corr1+tem_press1))","v":0},{"$f":"D55/60","v":0},"moon parallax"]
["March/Venus Add'l corr:",null,null,0,{"$f":"D56/60","v":0},"for Mach/Venus sight",null,null,null,null,null,null,null,null,null,null,null,null,"DIPshort (min):",null,{"$f":"IF(T53=\"ft\",-60*DEGREES(ATAN((hf1_/(6076.1*ds1_))+(ds1_/8268))),IF(T53=\"m\",-60*DEGREES(ATAN((hf1_/(1852*ds1_))+(ds1_/8268))),))","v":-3.0684571302186558}]
["Observed ALTITUDE"]
["Ho:",null,{"$f":"ROUNDDOWN(E58,0)","v":31},{"$f":"(E58-C58)*60","v":42.485267505587672},{"$f":"SUM(E44:E56)","v":31.708087791759795},"Corrected observed altitude",null,null,null,null,null,null,null,null,null,null,null,null,"ALTITUDE REFRACTION CORRECTION"]
[null,null,null,null,null,null,null,null,null,null,null,null,null,null,null,null,null,null,null,null,"deg","min","decimal"]
["Calculated ALTITUDE from AP:",null,null,null,null,null,null,null,null,null,null,null,null,null,null,null,null,null,"Altitude (Ha):",null,16,56.4,{"$f":"U60+V60/60","v":16.940000000000001}]
[null,null,null,null,null,null,null,null,null,null,null,null,null,null,null,null,null,null,"Correction (min):",null,{"$f":"IF(W60<15,-(34.133+4.197*W60+0.00428*W60^2)/(1+0.505*W60+0.0845*W60^2),-(0.97127/TAN(RADIANS(W60))-(0.00137/(TAN(RADIANS(W60)))^3)))","v":-3.1403374215047055}]
[null,null,"(deg)","(min)","(decimal)"]
["Hc:",null,{"$f":"ROUNDDOWN(E63,0)","v":31},{"$f":"(E63-C63)*60","v":33.44888609327171},{"$f":"DEGREES(ASIN(SIN(RADIANS(LAT1_))*SIN(RADIANS(DEC1_))+COS(RADIANS(LAT1_))*COS(RADIANS(DEC1_))*COS(RADIANS(LHA1_))))","v":31.557481434887862},null,null,null,null,null,null,null,null,null,null,null,null,null,"TEMPERATURE CONVERSION (°F to °C)"]
["Calculated North AZIMUTH from AP:",null,null,null,null,null,null,null,null,null,null,null,null,null,null,null,null,null,"Temp °F:",59,"Temp °C:",{"$f":"(T64-32)*5/9","v":15}]
[]
["AZ north (degrees):",null,null,null,{"$f":"IF(LHA1_>=180,Alt_AZ1,(360-Alt_AZ1))","v":264.75810790555602},"True north azimuth",null,null,null,null,null,null,null,null,null,null,null,null,"PRESSURE CONVERSION (inches Hg to mb)"]
["Offset of COP (nmi):",null,null,null,{"$f":"(HO1_-HC1_)*60","v":9.0363814123159614},"Toward(+)  Away(-)",null,null,"Check for updates:",null,null,"http://pchev-astronav-en.blogspot.ca/",null,null,null,null,null,null,"in Hg:",29.92,"mb:",{"$f":"T67*33.8638866667","v":1013.207489067664}]
[]
[null,null,null,null,null,null,null,null,null,null,null,null,null,null,null,null,null,null,"LONGITUDE TO TIME CONVERSION"]
[null,null,null,null,null,null,null,null,null,null,null,null,null,null,null,null,null,null,"Longitude",null,null,null,"Time"]
[null,null,null,null,null,null,null,null,null,null,null,null,null,null,null,null,null,null,"Degrees","Minutes","Seconds",null,"Hours","Minutes","Seconds"]
["Case of Latitude by Polaris sight",null,null,null,null,null,null,null,null,null,null,null,null,null,null,null,null,null,224,48.25,0,null,{"$f":"INT(S72/15)","v":14},{"$f":"INT((S72/15-INT(S72/15))*60+T72/15)","v":59},{"$f":"MOD(T72,15)*4+U72/15","v":13}]
["Lat = Ho - correction"]
["Correction = -(90-Déclination)xCos(LHA) + (90-Declination)xABS(Sin(LHA))xSin(ABS(Zn))",null,null,null,null,null,null,null,null,null,null,null,null,null,null,null,null,null,"TIME TO LONGITUDE CONVERSION"]
["Zn relative to True N:",null,{"$f":"IF(OR(LEFT(body1,7)=\"Polaris\",LEFT(body1,7)=\"polaris\"),IF(AZ_nord1>180,360-AZ_nord1,AZ_nord1),0)","v":0},null,null,null,null,null,null,null,null,null,null,null,null,null,null,null,"Time",null,null,null,"Longitude"]
[null,null,"deg","min",null,null,null,null,null,null,null,null,null,null,null,null,null,null,"Hours","Minutes","Seconds",null,"Degrees","Minutes","Seconds"]
["Latitude",null,{"$f":"ROUNDDOWN(E77,0)","v":0},{"$f":"(E77-C77)*60","v":0},{"$f":"IF(OR(LEFT(body1,7)=\"Polaris\",LEFT(body1,7)=\"polaris\"),HO1_-(90-tab_DEC1)*COS(RADIANS(LHA1_))+(90-tab_DEC1)*ABS(SIN(RADIANS(LHA1_)))*SIN(RADIANS(ABS(C75))),0)","v":0},null,null,null,null,null,null,null,null,null,null,null,null,null,14,59,13,null,{"$f":"S77*15+INT(T77/4)","v":224},{"$f":"MOD(T77,4)*15+U77/4","v":48.25}]
[null,null,null,null,null,null,null,null,null,null,null,null,null,null,null,null,null,null,null,null,null,null,{"$f":"S77*15+INT(T77/4)","v":224},{"$f":"MOD(T77,4)*15+INT(U77/4)","v":48},{"$f":"((U77/4)-INT(U77/4))*60","v":15}]
[]
["Altitude AZIMUTH:",null,null,null,{"$f":"IF(ABS(1-ABS(F80))<0.000000000001,IF(F80<0,DEGREES(ACOS(-1)),DEGREES(ACOS(1))),DEGREES(ACOS(F80)))","v":95.241892094443983},{"$f":"(SIN(RADIANS(DEC1_))-(SIN(RADIANS(LAT1_))*SIN(RADIANS(HC1_))))/(COS(RADIANS(LAT1_))*COS(RADIANS(HC1_)))","v":-9.1360701743540176E-2}]
["Time AZIMUTH",null,null,null,{"$f":"DEGREES(ATAN(SIN(RADIANS(LHA1_))/(COS(RADIANS(LAT1_))*TAN(RADIANS(DEC1_))-SIN(RADIANS(LAT1_))*COS(RADIANS(LHA1_)))))","v":-84.758107905556002}]

{"sheet":"Sight2","index":1,"n_rows":81,"n_cols":25,"rows_kept":81,"cut":false,"hidden":false,"merged":[]}
["PROGRAM FOR ASTRONOMICAL"]
["SIGHT REDUCTION"]
[]
["Assumed Position (AP)"]
[null,null,"(deg)","(min)","(decimal)"]
["LAT: (N, S)","N",47,0,{"$f":"IF(OR(LEFT(B6,1)=\"S\",LEFT(B6,1)=\"s\"),-(C6+D6/60),C6+D6/60)","v":47}]
["LON: (E, W)","W",71,38.9,{"$f":"IF(OR(LEFT(B7,1)=\"E\",LEFT(B7,1)=\"e\"),-(C7+D7/60),C7+D7/60)","v":71.648333333333326}]
[]
["Time of observation"]
["Date:","1987-07-28"]
[null,null,"(hours)","(min)","(sec)"]
["WT",null,22,56,51,{"$f":"TIME(C12,D12,E12)","v":0.95614583333333336}]
["WE: (f, s)","f",null,0,4,{"$f":"IF(OR(LEFT(B13,1)=\"F\",LEFT(B13,1)=\"f\"),-TIME(,D13,E13),TIME(,D13,E13))","v":-4.6296296296296294E-5}]
["ZT",null,{"$f":"HOUR(F14)","v":22},{"$f":"MINUTE(F14)","v":56},{"$f":"SECOND(F14)","v":47},{"$f":"SUM(F12:F13)","v":0.95609953703703709}]
["ZD: (E, W)","W",4,null,null,{"$f":"IF(OR(LEFT(B15,1)=\"E\",LEFT(B15,1)=\"e\"),-TIME(C15,,),TIME(C15,,))","v":0.16666666666666666}]
["UT:",null,{"$f":"IF(F16<0,23-HOUR(-F16),HOUR(F16))","v":2},{"$f":"IF(F16<0,59-MINUTE(-F16),MINUTE(F16))","v":56},{"$f":"IF(F16<0,60-SECOND(-F16),SECOND(F16))","v":47},{"$f":"SUM(F14:F15)","v":1.1227662037037038},{"$f":"(min2_/60)+(sec2_/3600)","v":0.94638888888888895}]
["UT Date",{"$f":"IF(F16>=1,VALUE(B10)+1,IF(F16<0,VALUE(B10)-1,VALUE(B10)))","v":"1987-07-29"}]
[]
["Observed celestial body",null,null,null,"Click here for Nautical Almanac"]
["Name:","Saturne",null,null,"Star/Sun-Planet/Moon:",null,2]
[null,null,"(deg)","(min)","(decimal)"]
["Dec: (N, S)","S",21,5.9,{"$f":"IF(OR(LEFT(B22,1)=\"S\",LEFT(B22,1)=\"s\"),-(C22+D22/60),C22+D22/60)","v":-21.098333333333333},"declination"]
["d: (+, -)",0,null,{"$f":"IF(OR(B22=\"S\",B22=\"s\"),-d_corr2_*60,d_corr2_*60)","v":0},{"$f":"IF(OR(LEFT(B22,1)=\"S\",LEFT(B22,1)=\"s\"),-(d2_*min_sec2/60),d2_*min_sec2/60)","v":0},"declination corr."]
["Corr. Dec.:",{"$f":"B22","v":"S"},{"$f":"ABS(ROUNDDOWN(E24,0))","v":21},{"$f":"(ABS(E24)-C24)*60","v":5.8999999999999631},{"$f":"tab_DEC2+d_corr2_","v":-21.098333333333333},"corrected dec."]
[]
["SHA:",null,0,0,{"$f":"C26+D26/60","v":0},"0 if not star"]
["GHAg (UT hours):",null,82,24.7,{"$f":"C27+D27/60","v":82.411666666666662},"GHA Aries or others"]
["UT min-sec:",null,{"$f":"ROUNDDOWN(minsec_corr2,0)","v":14},{"$f":"(minsec_corr2-C28)*60","v":11.750000000000078},{"$f":"IF(G20=1,min_sec2*15.0416667,IF(G20=2,min_sec2*15,IF(G20=3,min_sec2*14.316667,)))","v":14.195833333333335},"min-sec incr (calculated)"]
["v: (+, -)",2.6,null,{"$f":"v_corr2*60","v":2.4606111111111115},{"$f":"v2_*min_sec2/60","v":4.1010185185185191E-2},"GHA corr for planets"]
["GHAy",null,{"$f":"ROUNDDOWN(GHAy2,0)","v":96},{"$f":"(GHAy2-C30)*60","v":38.91061111111128},{"$f":"SUM(E27:E29)","v":96.648510185185188},"GHA Aries or others"]
["LHAy",null,null,null,{"$f":"GHAy2-LON2_","v":25.000176851851862},"LHA Aries",null,null,null,null,null,null,null,null,null,null,null,null,"CONVERTER dd.mm.ss to decimal "]
["GHA=GHAy+SHA",null,null,null,{"$f":"SUM(E26:E29)","v":96.648510185185188},null,null,null,null,null,null,null,null,null,null,null,null,null,"Deg","min","sec"]
["GHA corrected:",null,{"$f":"ROUNDDOWN(E33,0)","v":96},{"$f":"(E33-C33)*60","v":38.91061111111128},{"$f":"IF(GHAo2_>=360,(GHAo2_-360),GHAo2_)","v":96.648510185185188},"Note for midday sights",null,null,null,null,null,null,null,null,null,null,null,null,148,36.799999999999997,0]
[null,null,null,null,null,null,null,null,null,null,null,null,null,null,null,null,null,null,"Decimal:",{"$f":"S33+(T33/60)+(U33/3600)","v":148.61333333333334}]
["LHA=GHA-LON:",null,null,null,{"$f":"GHA2_-LON2_","v":25.000176851851862}]
["LHA corrected:",null,{"$f":"ROUNDDOWN(E36,0)","v":25},{"$f":"(E36-C36)*60","v":1.0611111111700211E-2},{"$f":"IF(LHAo2_>=360,LHAo2_-360,(IF(LHAo2_<0,360+LHAo2_,LHAo2_)))","v":25.000176851851862},null,null,null,null,null,null,null,null,null,null,null,null,null,"CONVERTER decimal to dd.mm.ss"]
[null,null,null,null,null,null,null,null,null,null,null,null,null,null,null,null,null,null,"Decimal:",4.8300000000000003E-2]
["Sextant observed altitude",null,null,null,null,null,null,null,null,null,null,null,null,null,null,null,null,null,"Deg","min","sec"]
["Hs:",null,18,21.3,{"$f":"C39+D39/60","v":18.355},"measured altitude",null,null,null,null,null,null,null,null,null,null,null,null,{"$f":"ROUNDDOWN(T37,0)","v":0},{"$f":"ROUNDDOWN(60*(T37-ROUNDDOWN(T37,0)),0)","v":2},{"$f":"60*(60*(T37-ROUNDDOWN(T37,0))-T39)","v":53.88000000000001}]
["index corr.: (+, -)",null,null,0.3,{"$f":"D40/60","v":5.0000000000000001E-3},"sextant 0° correction"]
["H.eye (ft,m):","ft",null,null,null,null,null,null,null,null,null,null,null,null,null,null,null,null,"GHA INTERPOLATOR for UT min and sec increment"]
[null,0,null,{"$f":"IF(B41=\"ft\",-0.97*SQRT(B42),IF(B41=\"m\",-1.76*SQRT(B42),))","v":0},{"$f":"D42/60","v":0},"height of eye correction",null,null,null,null,null,null,null,null,null,null,null,null,null,null,"deg","min","decimal"]
["Dip short of horizon:",null,null,0,{"$f":"D43/60","v":0},"when using shoreline horizon",null,null,null,null,null,null,null,null,null,null,null,null,"UT 1st hour GHA: ",null,82,24.7,{"$f":"U43+V43/60","v":82.411666666666662}]
["Ha:",null,{"$f":"ROUNDDOWN(E44,0)","v":18},{"$f":"(E44-C44)*60","v":21.599999999999966},{"$f":"SUM(E39:E43)","v":18.36},null,null,null,null,null,null,null,null,null,null,null,null,null,"UT 2nd hour GHA: ",null,97,27.3,{"$f":"U44+V44/60","v":97.454999999999998}]
["Alt corr:",null,null,{"$f":"IF(Ha2_<15,-(34.133+4.197*Ha2_+0.00428*Ha2_^2)/(1+0.505*Ha2_+0.0845*Ha2_^2),-(0.97127/TAN(RADIANS(Ha2_))-(0.00137/(TAN(RADIANS(Ha2_)))^3)))","v":-2.8890873783060687},{"$f":"D45/60","v":-4.8151456305101141E-2},"refraction correction"]
["Additional correction for non-std temperature and pressure",null,null,null,null,"supp refraction corr",null,null,null,null,null,null,null,null,null,null,null,null,null,null,"min","sec","decimal"]
["Temp (°C):",10,null,null,null,"f factor:",{"$f":"(Press_mb2/1010)*(283/(273+Temp_C2))","v":1},null,null,null,null,null,null,null,null,null,null,null,"UT min-sec incr:",null,{"$f":"min2_","v":56},{"$f":"sec2_","v":47},{"$f":"U47/60+V47/3600","v":0.94638888888888895}]
["Press. (mb):",1010]
["Add'l corr:",null,null,{"$f":"std_hcorr2*(f2_-1)","v":0},{"$f":"TP_corr2/60","v":0},null,null,null,null,null,null,null,null,null,null,null,null,null,null,null,"deg","min","decimal"]
[null,null,null,null,null,null,null,null,null,null,null,null,null,null,null,null,null,null,"GHA increment:",null,{"$f":"ROUNDDOWN(W50,0)","v":14},{"$f":"(W50-U50)*60","v":14.210611111111362},{"$f":"(W44-W43)*W47","v":14.236843518518523}]
["Special corrections (Sun/Moon/March/Venus)"]
[null,"Limb","S.D.",null,null,null,null,null,null,null,null,null,null,null,null,null,null,null,"DIP-SHORT-OF-HORIZON CALCULATOR"]
["Sun:","L",0,{"$f":"IF(B53=\"L\",IF(C53>0,(C53+0.14657*COS(RADIANS(Ha2_+Alt_corr2+Alt_corr2))),),IF(B53=\"U\",IF(C53>0,(-C53+0.14657*COS(RADIANS(Ha2_+Alt_corr2+tem_press2))),)))","v":0},{"$f":"D53/60","v":0},"for Sun sight",null,null,null,null,null,null,null,null,null,null,null,null,"Height:","ft",7]
["Moon:","L",0,{"$f":"IF(B54=\"L\",C54,IF(B54=\"U\",-C54,0))","v":0},{"$f":"D54/60","v":0},"for Moon sight",null,null,null,null,null,null,null,null,null,null,null,null,"Dist. to horiz (nmi):",null,3.6]
["Moon HP:",0,null,{"$f":"B55*COS(RADIANS(Ha2_+Alt_corr2+tem_press2))","v":0},{"$f":"D55/60","v":0},"moon parallax"]
["March/Venus Add'l corr:",null,null,0,{"$f":"D56/60","v":0},"for Mach/Venus sight",null,null,null,null,null,null,null,null,null,null,null,null,"DIPshort (min):",null,{"$f":"IF(T53=\"ft\",-60*DEGREES(ATAN((hf2_/(6076.1*ds2_))+(ds2_/8268))),IF(T53=\"m\",-60*DEGREES(ATAN((hf2_/(1852*ds2_))+(ds2_/8268))),))","v":-2.5969726210721298}]
["Observed ALTITUDE"]
["Ho:",null,{"$f":"ROUNDDOWN(E58,0)","v":18},{"$f":"(E58-C58)*60","v":18.710912621693794},{"$f":"SUM(E44:E56)","v":18.311848543694897},"corrected observed altitude",null,null,null,null,null,null,null,null,null,null,null,null,"ALTITUDE REFRACTION CORRECTION"]
[null,null,null,null,null,null,null,null,null,null,null,null,null,null,null,null,null,null,null,null,"deg","min","decimal"]
["Calculated ALTITUDE from AP:",null,null,null,null,null,null,null,null,null,null,null,null,null,null,null,null,null,"Altitude (Ha):",null,16,56.4,{"$f":"U60+V60/60","v":16.940000000000001}]
[null,null,null,null,null,null,null,null,null,null,null,null,null,null,null,null,null,null,"Correction (min):",null,{"$f":"IF(W60<15,-(34.133+4.197*W60+0.00428*W60^2)/(1+0.505*W60+0.0845*W60^2),-(0.97127/TAN(RADIANS(W60))-(0.00137/(TAN(RADIANS(W60)))^3)))","v":-3.1403374215047055}]
[null,null,"(deg)","(min)","(decimal)"]
["Hc:",null,{"$f":"ROUNDDOWN(E63,0)","v":18},{"$f":"(E63-C63)*60","v":15.8530891892309},{"$f":"DEGREES(ASIN(SIN(RADIANS(LAT2_))*SIN(RADIANS(DEC2_))+COS(RADIANS(LAT2_))*COS(RADIANS(DEC2_))*COS(RADIANS(LHA2_))))","v":18.264218153153848},null,null,null,null,null,null,null,null,null,null,null,null,null,"TEMPERATURE CONVERSION (°F to °C)"]
["Calculated North AZIMUTH from AP:",null,null,null,null,null,null,null,null,null,null,null,null,null,null,null,null,null,"Temp °F:",59,"Temp °C:",{"$f":"(T64-32)*5/9","v":15}]
[]
["AZ north:",null,null,null,{"$f":"IF(LHA2_>=180,Alt_AZ2,(360-Alt_AZ2))","v":204.53240535865166},"True north azimuth",null,null,null,null,null,null,null,null,null,null,null,null,"PRESSURE CONVERSION (inches Hg to mb)"]
["Offset of COP (nmi)",null,null,null,{"$f":"(HO2_-HC2_)*60","v":2.8578234324628937},"Toward(+)  Away(-)",null,null,null,null,null,null,null,null,null,null,null,null,"in Hg:",29.92,"mb:",{"$f":"T67*33.8638866667","v":1013.207489067664}]
[]
[null,null,null,null,null,null,null,null,null,null,null,null,null,null,null,null,null,null,"LONGITUDE TO TIME CONVERSION"]
[null,null,null,null,null,null,null,null,null,null,null,null,null,null,null,null,null,null,"Longitude",null,null,null,"Time"]
[null,null,null,null,null,null,null,null,null,null,null,null,null,null,null,null,null,null,"Degrees","Minutes","Seconds",null,"Hours","Minutes","Seconds"]
["Case of Latitude by Polaris sight",null,null,null,null,null,null,null,null,null,null,null,null,null,null,null,null,null,224,48.25,0,null,{"$f":"INT(S72/15)","v":14},{"$f":"INT((S72/15-INT(S72/15))*60+T72/15)","v":59},{"$f":"MOD(T72,15)*4+U72/15","v":13}]
["Lat = Ho - correction"]
["Correction = -(90-Déclination)xCos(LHA) + (90-Declination)xABS(Sin(LHA))xSin(ABS(Zn))",null,null,null,null,null,null,null,null,null,null,null,null,null,null,null,null,null,"TIME TO LONGITUDE CONVERSION"]
["Zn relative to True N:",null,{"$f":"IF(OR(LEFT(body2,7)=\"Polaris\",LEFT(body2,7)=\"polaris\"),IF(AZ_nord2>180,360-AZ_nord2,AZ_nord2),0)","v":0},null,null,null,null,null,null,null,null,null,null,null,null,null,null,null,"Time",null,null,null,"Longitude"]
[null,null,"deg","min",null,null,null,null,null,null,null,null,null,null,null,null,null,null,"Hours","Minutes","Seconds",null,"Degrees","Minutes","Seconds"]
["Latitude",null,{"$f":"ROUNDDOWN(E77,0)","v":0},{"$f":"(E77-C77)*60","v":0},{"$f":"IF(OR(LEFT(body2,7)=\"Polaris\",LEFT(body2,7)=\"polaris\"),HO2_-(90-tab_DEC2)*COS(RADIANS(LHA2_))+(90-tab_DEC2)*ABS(SIN(RADIANS(LHA2_)))*SIN(RADIANS(ABS(C75))),0)","v":0},null,null,null,null,null,null,null,null,null,null,null,null,null,14,59,13,null,{"$f":"S77*15+INT(T77/4)","v":224},{"$f":"MOD(T77,4)*15+U77/4","v":48.25}]
[null,null,null,null,null,null,null,null,null,null,null,null,null,null,null,null,null,null,null,null,null,null,{"$f":"S77*15+INT(T77/4)","v":224},{"$f":"MOD(T77,4)*15+INT(U77/4)","v":48},{"$f":"((U77/4)-INT(U77/4))*60","v":15}]
[]
["Altitude AZIMUTH:",null,null,null,{"$f":"IF(ABS(1-ABS(F80))<0.000000000001,IF(F80<0,DEGREES(ACOS(-1)),DEGREES(ACOS(1))),DEGREES(ACOS(F80)))","v":155.46759464134834},{"$f":"(SIN(RADIANS(DEC2_))-(SIN(RADIANS(LAT2_))*SIN(RADIANS(HC2_))))/(COS(RADIANS(LAT2_))*COS(RADIANS(HC2_)))","v":-0.90972658306072596}]
["Time AZIMUTH",null,null,null,{"$f":"DEGREES(ATAN(SIN(RADIANS(LHA2_))/(COS(RADIANS(LAT2_))*TAN(RADIANS(DEC2_))-SIN(RADIANS(LAT2_))*COS(RADIANS(LHA2_)))))","v":-24.532405358651648}]

{"sheet":"Sight3","index":2,"n_rows":81,"n_cols":25,"rows_kept":81,"cut":false,"hidden":false,"merged":[]}
["PROGRAM FOR ASTRONOMICAL"]
["SIGHT REDUCTION"]
[]
["Assumed Position (AP)"]
[null,null,"(deg)","(min)","(decimal)"]
["LAT: (N, S)","N",47,0,{"$f":"IF(OR(LEFT(B6,1)=\"S\",LEFT(B6,1)=\"s\"),-(C6+D6/60),C6+D6/60)","v":47}]
["LON: (E, W)","W",71,12.2,{"$f":"IF(OR(LEFT(B7,1)=\"E\",LEFT(B7,1)=\"e\"),-(C7+D7/60),C7+D7/60)","v":71.203333333333333}]
[]
["Time of observation"]
["Date:","1987-07-28"]
[null,null,"(hours)","(min)","(sec)"]
["WT",null,22,58,8,{"$f":"TIME(C12,D12,E12)","v":0.95703703703703702}]
["WE: (f, s)","f",null,0,4,{"$f":"IF(OR(LEFT(B13,1)=\"F\",LEFT(B13,1)=\"f\"),-TIME(,D13,E13),TIME(,D13,E13))","v":-4.6296296296296294E-5}]
["ZT",null,{"$f":"HOUR(F14)","v":22},{"$f":"MINUTE(F14)","v":58},{"$f":"SECOND(F14)","v":4},{"$f":"SUM(F12:F13)","v":0.95699074074074075}]
["ZD: (E, W)","W",4,null,null,{"$f":"IF(OR(LEFT(B15,1)=\"E\",LEFT(B15,1)=\"e\"),-TIME(C15,,),TIME(C15,,))","v":0.16666666666666666}]
["UT:",null,{"$f":"IF(F16<0,23-HOUR(-F16),HOUR(F16))","v":2},{"$f":"IF(F16<0,59-MINUTE(-F16),MINUTE(F16))","v":58},{"$f":"IF(F16<0,60-SECOND(-F16),SECOND(F16))","v":4},{"$f":"SUM(F14:F15)","v":1.1236574074074075},{"$f":"(min3_/60)+(sec3_/3600)","v":0.96777777777777774}]
["UT Date",{"$f":"IF(F16>=1,VALUE(B10)+1,IF(F16<0,VALUE(B10)-1,VALUE(B10)))","v":"1987-07-29"}]
[]
["Observed celestial body",null,null,null,"Click here for Nautical Almanac"]
["Name:","Altaïr",null,null,"Star/Sun-Planet/Moon:",null,1]
[null,null,"(deg)","(min)","(decimal)"]
["Dec: (N, S)","N",8,50,{"$f":"IF(OR(LEFT(B22,1)=\"S\",LEFT(B22,1)=\"s\"),-(C22+D22/60),C22+D22/60)","v":8.8333333333333339},"declination"]
["d: (+, -)",0,null,{"$f":"IF(OR(B22=\"S\",B22=\"s\"),-d_corr3_*60,d_corr3_*60)","v":0},{"$f":"IF(OR(LEFT(B22,1)=\"S\",LEFT(B22,1)=\"s\"),-(d3_*min_sec3/60),d3_*min_sec3/60)","v":0},"declination corr."]
["Corr. Dec.:",{"$f":"B22","v":"N"},{"$f":"ABS(ROUNDDOWN(E24,0))","v":8},{"$f":"(ABS(E24)-C24)*60","v":50.000000000000036},{"$f":"tab_DEC3+d_corr3_","v":8.8333333333333339},"corrected dec."]
[]
["SHA:",null,62,27,{"$f":"C26+D26/60","v":62.45},"0 if not star"]
["GHAg (UT hours):",null,336,11.8,{"$f":"C27+D27/60","v":336.19666666666666},"GHA Aries or others"]
["UT min-sec:",null,{"$f":"ROUNDDOWN(minsec_corr3,0)","v":14},{"$f":"(minsec_corr3-C28)*60","v":33.41944637999994},{"$f":"IF(G20=1,min_sec3*15.0416667,IF(G20=2,min_sec3*15,IF(G20=3,min_sec3*14.316667,)))","v":14.556990772999999},"min-sec incr (calculated)"]
["v: (+, -)",0,null,{"$f":"v_corr3*60","v":0},{"$f":"v3_*min_sec3/60","v":0},"GHA corr for planets"]
["GHAy",null,{"$f":"ROUNDDOWN(GHAy3,0)","v":350},{"$f":"(GHAy3-C30)*60","v":45.219446379999226},{"$f":"SUM(E27:E29)","v":350.75365743966665},"GHA Aries or others"]
["LHAy",null,null,null,{"$f":"GHAy3-LON3_","v":279.55032410633333},"LHA Aries",null,null,null,null,null,null,null,null,null,null,null,null,"CONVERTER dd.mm.ss to decimal "]
["GHA=GHAy+SHA",null,null,null,{"$f":"SUM(E26:E29)","v":413.20365743966664},null,null,null,null,null,null,null,null,null,null,null,null,null,"Deg","min","sec"]
["GHA corrected:",null,{"$f":"ROUNDDOWN(E33,0)","v":53},{"$f":"(E33-C33)*60","v":12.219446379998544},{"$f":"IF(GHAo3_>=360,(GHAo3_-360),GHAo3_)","v":53.203657439666642},"Note for midday sights",null,null,null,null,null,null,null,null,null,null,null,null,148,36.799999999999997,0]
[null,null,null,null,null,null,null,null,null,null,null,null,null,null,null,null,null,null,"Decimal:",{"$f":"S33+(T33/60)+(U33/3600)","v":148.61333333333334}]
["LHA=GHA-LON:",null,null,null,{"$f":"GHA3_-LON3_","v":-17.999675893666691}]
["LHA corrected:",null,{"$f":"ROUNDDOWN(E36,0)","v":342},{"$f":"(E36-C36)*60","v":1.9446379999408236E-2},{"$f":"IF(LHAo3_>=360,LHAo3_-360,(IF(LHAo3_<0,360+LHAo3_,LHAo3_)))","v":342.00032410633332},null,null,null,null,null,null,null,null,null,null,null,null,null,"CONVERTER decimal to dd.mm.ss"]
[null,null,null,null,null,null,null,null,null,null,null,null,null,null,null,null,null,null,"Decimal:",4.8300000000000003E-2]
["Sextant observed altitude",null,null,null,null,null,null,null,null,null,null,null,null,null,null,null,null,null,"Deg","min","sec"]
["Hs:",null,48,57.1,{"$f":"C39+D39/60","v":48.951666666666668},"measured altitude",null,null,null,null,null,null,null,null,null,null,null,null,{"$f":"ROUNDDOWN(T37,0)","v":0},{"$f":"ROUNDDOWN(60*(T37-ROUNDDOWN(T37,0)),0)","v":2},{"$f":"60*(60*(T37-ROUNDDOWN(T37,0))-T39)","v":53.88000000000001}]
["index corr.: (+, -)",null,null,0.3,{"$f":"D40/60","v":5.0000000000000001E-3},"sextant 0° correction"]
["H.eye (ft,m):","ft",null,null,null,null,null,null,null,null,null,null,null,null,null,null,null,null,"GHA INTERPOLATOR for UT min and sec increment"]
[null,0,null,{"$f":"IF(B41=\"ft\",-0.97*SQRT(B42),IF(B41=\"m\",-1.76*SQRT(B42),))","v":0},{"$f":"D42/60","v":0},"height of eye correction",null,null,null,null,null,null,null,null,null,null,null,null,null,null,"deg","min","decimal"]
["Dip short of horizon:",null,null,0,{"$f":"D43/60","v":0},"when using shoreline horizon",null,null,null,null,null,null,null,null,null,null,null,null,"UT 1st hour GHA: ",null,336,11.8,{"$f":"U43+V43/60","v":336.19666666666666}]
["Ha:",null,{"$f":"ROUNDDOWN(E44,0)","v":48},{"$f":"(E44-C44)*60","v":57.400000000000233},{"$f":"SUM(E39:E43)","v":48.956666666666671},null,null,null,null,null,null,null,null,null,null,null,null,null,"UT 2nd hour GHA: ",null,351,14.2,{"$f":"U44+V44/60","v":351.23666666666668}]
["Alt corr:",null,null,{"$f":"IF(Ha3_<15,-(34.133+4.197*Ha3_+0.00428*Ha3_^2)/(1+0.505*Ha3_+0.0845*Ha3_^2),-(0.97127/TAN(RADIANS(Ha3_))-(0.00137/(TAN(RADIANS(Ha3_)))^3)))","v":-0.84469858686307442},{"$f":"D45/60","v":-1.407830978105124E-2},"refraction correction"]
["Additional correction for non-std temperature and pressure",null,null,null,null,"supp refraction corr",null,null,null,null,null,null,null,null,null,null,null,null,null,null,"min","sec","decimal"]
["Temp (°C):",10,null,null,null,"f factor:",{"$f":"(Press_mb3/1010)*(283/(273+Temp_C3))","v":1},null,null,null,null,null,null,null,null,null,null,null,"UT min-sec incr:",null,{"$f":"min3_","v":58},{"$f":"sec3_","v":4},{"$f":"U47/60+V47/3600","v":0.96777777777777774}]
["Press. (mb):",1010]
["Add'l corr:",null,null,{"$f":"std_hcorr3*(f3_-1)","v":0},{"$f":"TP_corr3/60","v":0},null,null,null,null,null,null,null,null,null,null,null,null,null,null,null,"deg","min","decimal"]
[null,null,null,null,null,null,null,null,null,null,null,null,null,null,null,null,null,null,"GHA increment:",null,{"$f":"ROUNDDOWN(W50,0)","v":14},{"$f":"(W50-U50)*60","v":33.322666666667864},{"$f":"(W44-W43)*W47","v":14.555377777777798}]
["Special corrections (Sun/Moon/March/Venus)"]
[null,"Limb","S.D.",null,null,null,null,null,null,null,null,null,null,null,null,null,null,null,"DIP-SHORT-OF-HORIZON CALCULATOR"]
["Sun:","L",0,{"$f":"IF(B53=\"L\",IF(C53>0,(C53+0.14657*COS(RADIANS(Ha3_+Alt_corr3+tem_press3))),),IF(B53=\"U\",IF(C53>0,(-C53+0.14657*COS(RADIANS(Ha3_+Alt_corr3+tem_press3))),)))","v":0},{"$f":"D53/60","v":0},"for Sun sight",null,null,null,null,null,null,null,null,null,null,null,null,"Height:","ft",8]
["Moon:","L",0,{"$f":"IF(B54=\"L\",C54,IF(B54=\"U\",-C54,0))","v":0},{"$f":"D54/60","v":0},"for Moon sight",null,null,null,null,null,null,null,null,null,null,null,null,"Dist. to horiz (nmi):",null,3.6]
["Moon HP:",0,null,{"$f":"B55*COS(RADIANS(Ha3_+Alt_corr3+tem_press3))","v":0},{"$f":"D55/60","v":0},"moon parallax"]
["March/Venus Add'l corr:",null,null,0,{"$f":"D56/60","v":0},"for Mach/Venus sight",null,null,null,null,null,null,null,null,null,null,null,null,"DIPshort (min):",null,{"$f":"IF(T53=\"ft\",-60*DEGREES(ATAN((hf3_/(6076.1*ds3_))+(ds3_/8268))),IF(T53=\"m\",-60*DEGREES(ATAN((hf3_/(1852*ds3_))+(ds3_/8268))),))","v":-2.7541341358521874}]
["Observed ALTITUDE"]
["Ho:",null,{"$f":"ROUNDDOWN(E58,0)","v":48},{"$f":"(E58-C58)*60","v":56.555301413137329},{"$f":"SUM(E44:E56)","v":48.942588356885622},"corrected value",null,null,null,null,null,null,null,null,null,null,null,null,"ALTITUDE REFRACTION CORRECTION"]
[null,null,null,null,null,null,null,null,null,null,null,null,null,null,null,null,null,null,null,null,"deg","min","decimal"]
["Calculated ALTITUDE from AP:",null,null,null,null,null,null,null,null,null,null,null,null,null,null,null,null,null,"Altitude (Ha):",null,16,56.4,{"$f":"U60+V60/60","v":16.940000000000001}]
[null,null,null,null,null,null,null,null,null,null,null,null,null,null,null,null,null,null,"Correction (min):",null,{"$f":"IF(W60<15,-(34.133+4.197*W60+0.00428*W60^2)/(1+0.505*W60+0.0845*W60^2),-(0.97127/TAN(RADIANS(W60))-(0.00137/(TAN(RADIANS(W60)))^3)))","v":-3.1403374215047055}]
[null,null,"(deg)","(min)","(decimal)"]
["Hc:",null,{"$f":"ROUNDDOWN(E63,0)","v":48},{"$f":"(E63-C63)*60","v":52.279209562244375},{"$f":"DEGREES(ASIN(SIN(RADIANS(LAT3_))*SIN(RADIANS(DEC3_))+COS(RADIANS(LAT3_))*COS(RADIANS(DEC3_))*COS(RADIANS(LHA3_))))","v":48.87132015937074},null,null,null,null,null,null,null,null,null,null,null,null,null,"TEMPERATURE CONVERSION (°F to °C)"]
["Calculated North AZIMUTH from AP:",null,null,null,null,null,null,null,null,null,null,null,null,null,null,null,null,null,"Temp °F:",68,"Temp °C:",{"$f":"(T64-32)*5/9","v":20}]
[]
["AZ north:",null,null,null,{"$f":"IF(LHA3_>=180,Alt_AZ3,(360-Alt_AZ3))","v":152.33978530454002},"True north azimuth",null,null,null,null,null,null,null,null,null,null,null,null,"PRESSURE CONVERSION (inches Hg to mb)"]
["Offset of COP (nmi)",null,null,null,{"$f":"(HO3_-HC3_)*60","v":4.2760918508929535},"Toward(+)  Away(-)",null,null,null,null,null,null,null,null,null,null,null,null,"in Hg:",30,"mb:",{"$f":"T67*33.8638866667","v":1015.9166000009999}]
[]
[null,null,null,null,null,null,null,null,null,null,null,null,null,null,null,null,null,null,"LONGITUDE TO TIME CONVERSION"]
[null,null,null,null,null,null,null,null,null,null,null,null,null,null,null,null,null,null,"Longitude",null,null,null,"Time"]
[null,null,null,null,null,null,null,null,null,null,null,null,null,null,null,null,null,null,"Degrees","Minutes","Seconds",null,"Hours","Minutes","Seconds"]
["Case of Latitude by Polaris sight",null,null,null,null,null,null,null,null,null,null,null,null,null,null,null,null,null,224,48.25,0,null,{"$f":"INT(S72/15)","v":14},{"$f":"INT((S72/15-INT(S72/15))*60+T72/15)","v":59},{"$f":"MOD(T72,15)*4+U72/15","v":13}]
["Lat = Ho - correction"]
["Correction = -(90-Déclination)xCos(LHA) + (90-Declination)xABS(Sin(LHA))xSin(ABS(Zn))",null,null,null,null,null,null,null,null,null,null,null,null,null,null,null,null,null,"TIME TO LONGITUDE CONVERSION"]
["Zn relative to True N:",null,{"$f":"IF(OR(LEFT(body3,7)=\"Polaris\",LEFT(body3,7)=\"polaris\"),IF(AZ_nord3>180,360-AZ_nord3,AZ_nord3),0)","v":0},null,null,null,null,null,null,null,null,null,null,null,null,null,null,null,"Time",null,null,null,"Longitude"]
[null,null,"deg","min",null,null,null,null,null,null,null,null,null,null,null,null,null,null,"Hours","Minutes","Seconds",null,"Degrees","Minutes","Seconds"]
["Latitude",null,{"$f":"ROUNDDOWN(E77,0)","v":0},{"$f":"(E77-C77)*60","v":0},{"$f":"IF(OR(LEFT(body3,7)=\"Polaris\",LEFT(body3,7)=\"polaris\"),HO3_-(90-tab_DEC3)*COS(RADIANS(LHA3_))+(90-tab_DEC3)*ABS(SIN(RADIANS(LHA3_)))*SIN(RADIANS(ABS(C75))),0)","v":0},null,null,null,null,null,null,null,null,null,null,null,null,null,14,59,13,null,{"$f":"S77*15+INT(T77/4)","v":224},{"$f":"MOD(T77,4)*15+U77/4","v":48.25}]
[null,null,null,null,null,null,null,null,null,null,null,null,null,null,null,null,null,null,null,null,null,null,{"$f":"S77*15+INT(T77/4)","v":224},{"$f":"MOD(T77,4)*15+INT(U77/4)","v":48},{"$f":"((U77/4)-INT(U77/4))*60","v":15}]
[]
["Altitude AZIMUTH:",null,null,null,{"$f":"IF(ABS(1-ABS(F80))<0.000000000001,IF(F80<0,DEGREES(ACOS(-1)),DEGREES(ACOS(1))),DEGREES(ACOS(F80)))","v":152.33978530454002},{"$f":"(SIN(RADIANS(DEC3_))-(SIN(RADIANS(LAT3_))*SIN(RADIANS(HC3_))))/(COS(RADIANS(LAT3_))*COS(RADIANS(HC3_)))","v":-0.88571619141192259}]
["Time AZIMUTH",null,null,null,{"$f":"DEGREES(ATAN(SIN(RADIANS(LHA3_))/(COS(RADIANS(LAT3_))*TAN(RADIANS(DEC3_))-SIN(RADIANS(LAT3_))*COS(RADIANS(LHA3_)))))","v":27.660214695459977}]

{"sheet":"LOP plot","index":3,"n_rows":75,"n_cols":29,"rows_kept":75,"cut":false,"hidden":false,"merged":[]}
["CIRCLE OF POSITION, INTERCEPT and OFFSET plots",null,null,null,null,null,null,null,null,null,null,null,null,null,null,null,null,null,"Find intersection of COPs by linear bestfit approximation"]
["for various sights",null,null,null,null,null,null,null,null,null,null,null,null,null,null,null,null,null,"n=0: x=my+b    n=1:  y=mx+b "]
[null,null,null,null,null,null,null,null,null,null,null,null,null,null,null,null,null,null,"Click on available COPs"]
[null,null,null,null,null,null,null,null,null,null,null,null,null,null,null,null,null,null,null,null,null,null,"m","b","n"]
["Scales: the LONgitude scale is adjusted for the LATitude",null,null,null,null,null,null,null,null,null,null,null,null,null,null,null,null,null,null,null,null,"LOP1:",{"$f":"_m1","v":0.13864715277387213},{"$f":"_b1","v":64.845573991166702},{"$f":"_n1","v":0}]
["to preserve conformity of distance and azimuth,",null,null,null,null,null,null,null,null,null,null,null,null,null,null,null,null,null,null,null,null,"LOP2:",{"$f":"_m2","v":0.31524666485666425},{"$f":"_b2","v":24.360802998386188},{"$f":"_n2","v":1}]
["for a distortion free mapping.",null,null,null,null,null,null,null,null,null,null,null,null,null,null,null,null,null,null,null,null,"LOP3:",{"$f":"_m3","v":-0.36655749183607805},{"$f":"_b3","v":73.020528908686444},{"$f":"_n3","v":1}]
[]
[]
[null,null,null,null,null,null,null,null,null,null,null,null,null,null,null,null,null,null,null,null,"deg","min","decimal"]
[null,null,null,null,null,null,null,null,null,null,null,null,null,null,null,null,null,null,"Intersection COP1-COP2"]
[null,null,null,null,null,null,null,null,null,null,null,null,null,null,null,null,null,null,"LAT",{"$f":"IF(W12<0,\"S\",\"N\")","v":"N"},{"$f":"ROUNDDOWN(ABS(W12),0)","v":46},{"$f":"(ABS(W12)-U12)*60","v":51.058541303013811},46.850975688383564]
[null,null,null,null,null,null,null,null,null,null,null,null,null,null,null,null,null,null,"LON",{"$f":"IF(W13<0,\"E\",\"W\")","v":"W"},{"$f":"ROUNDDOWN(ABS(W13),0)","v":71},{"$f":"(ABS(W13)-U13)*60","v":20.490523233258955},71.341508720554316]
["\"min\" and \"max\" values of the Lat and Lon scales",null,null,null,null,null,null,null,null,null,null,null,null,null,null,null,null,null,"Intersection COP1-COP3"]
["LAT","LON",null,"scale factor:",null,0.5,null,null,null,null,null,null,null,null,null,null,null,null,"LAT",{"$f":"IF(W15<0,\"S\",\"N\")","v":"N"},{"$f":"ROUNDDOWN(ABS(W15),0)","v":46},{"$f":"(ABS(W15)-U15)*60","v":52.115289858327003},46.86858816430545]
[{"$f":"Latc-scale+offV0","v":46.4},{"$f":"D16+offH","v":70.599999999999994},null,{"$f":"Lonc-scale","v":70.5},{"$f":"((D17-D16)/COS(RADIANS(Latc)))","v":1.4662791856396249},null,null,null,null,null,null,null,null,null,null,null,null,null,"LON",{"$f":"IF(W16<0,\"E\",\"W\")","v":"W"},{"$f":"ROUNDDOWN(ABS(W16),0)","v":71},20.633258013016871,71.343887633550281]
[{"$f":"Latc+scale+offV0","v":47.4},{"$f":"D16+E16+offH","v":72.066279185639615},null,{"$f":"Lonc+scale","v":71.5},{"$f":"COS(RADIANS(Latc))","v":0.68199836006249848},null,null,null,null,null,null,null,null,null,null,null,null,null,"Intersection COP2-COP3",null,null,null,null,null,"Three-points fix solution (3 COPs required)"]
[null,null,null,null,null,null,null,null,null,null,null,null,null,null,null,null,null,null,"LAT",{"$f":"IF(W18<0,\"S\",\"N\")","v":"N"},{"$f":"ROUNDDOWN(ABS(W18),0)","v":46},{"$f":"(ABS(W18)-U18)*60","v":51.57453762295134},46.859575627049189,null,"LAT",{"$f":"IF(AC18<0,\"S\",\"N\")","v":"N"},{"$f":"ROUNDDOWN(ABS(AC18),0)","v":46},{"$f":"(ABS(AC18)-AA18)*60","v":51.582789594764193},46.859713159912737]
[null,null,null,null,null,"Chart-center offset:",null,null,null,null,null,null,null,null,null,null,null,null,"LON",{"$f":"IF(W19<0,\"E\",\"W\")","v":"W"},{"$f":"ROUNDDOWN(ABS(W19),0)","v":71},22.127325069598953,71.368788751159983,null,"LON",{"$f":"IF(AC19<0,\"E\",\"W\")","v":"W"},{"$f":"ROUNDDOWN(ABS(AC19),0)","v":71},{"$f":"(ABS(AC19)-AA19)*60","v":21.083702105292161},71.351395035088203]
[null,null,null,null,null,null,-0.1]
[]
[null,null,null,null,null,0.1,null,null,null,null,null,null,null,null,null,null,null,null,"Meridian passage sight position (\"Sight1\")"]
["Graph centered on sight:",null,null,1,null,null,null,null,null,null,null,null,null,null,null,null,null,null,"LAT",{"$f":"IF(W23<0,\"S\",\"N\")","v":"N"},{"$f":"ROUNDDOWN(ABS(W23),0)","v":0},{"$f":"(ABS(W23)-U23)*60","v":0}]
["Latc","Lonc",null,null,null,null,null,null,null,null,null,null,null,null,null,null,null,null,"LON",{"$f":"IF(W24<0,\"E\",\"W\")","v":"W"},{"$f":"ROUNDDOWN(ABS(W24),0)","v":0},0]
[{"$f":"IF(sight_n=1,ROUND(LAT1_,0),IF(sight_n=2,ROUND(Sight2!LAT2_,0),IF(sight_n=3,ROUND(Sight3!LAT3_,0),)))","v":47},{"$f":"IF(sight_n=1,ROUND(LON1_,0),IF(sight_n=2,ROUND(Sight2!LON2_,0),IF(sight_n=3,ROUND(Sight3!LON3_,0),)))","v":71},null,null,null,null,null,null,null,null,null,null,null,null,null,null,null,null,"Meridian passage sight position (\"Sight2\")"]
[null,null,null,null,null,null,null,null,null,null,null,null,null,null,null,null,null,null,"LAT",{"$f":"IF(W26<0,\"S\",\"N\")","v":"N"},{"$f":"ROUNDDOWN(ABS(W26),0)","v":0},{"$f":"(ABS(W26)-U26)*60","v":0}]
["spinbuttons","Offsets",null,null,null,null,null,null,null,null,null,null,null,null,null,null,null,null,"LON",{"$f":"IF(W27<0,\"E\",\"W\")","v":"W"},{"$f":"ROUNDDOWN(ABS(W27),0)","v":0},{"$f":"(ABS(W27)-U27)*60","v":0}]
[2,-0.1,null,null,null,null,null,null,null,null,null,null,null,null,null,null,null,null,"Meridian passage sight position (\"Sight3\")",null,null,null,null,null,"Average meridian passage position (\"Sights 1, 2, 3\")"]
[2,0.1,null,null,null,null,null,null,null,null,null,null,null,null,null,null,null,null,"LAT",{"$f":"IF(W29<0,\"S\",\"N\")","v":"N"},{"$f":"ROUNDDOWN(ABS(W29),0)","v":0},{"$f":"(ABS(W29)-U29)*60","v":0},null,null,"LAT",{"$f":"IF(AC29<0,\"S\",\"N\")","v":"N"},{"$f":"ROUNDDOWN(ABS(AC29),0)","v":0},{"$f":"(ABS(AC29)-AA29)*60","v":0}]
[null,null,null,null,null,null,null,null,null,null,null,null,null,null,null,null,null,null,"LON",{"$f":"IF(W30<0,\"E\",\"W\")","v":"W"},{"$f":"ROUNDDOWN(ABS(W30),0)","v":0},{"$f":"(ABS(W30)-U30)*60","v":0},null,null,"LON",{"$f":"IF(AC30<0,\"E\",\"W\")","v":"W"},{"$f":"ROUNDDOWN(ABS(AC30),0)","v":0},{"$f":"(ABS(AC30)-AA30)*60","v":0}]
[]
[]
["Assumed Position 1",null,null,null,null,null,null,null,"Assumed Position 2",null,null,null,null,null,null,null,"Assumed Position 3"]
["LAT1","LON1",null,null,null,null,null,null,"LAT2","LON2",null,null,null,null,null,null,"LAT3","LON3"]
[{"$f":"LAT1_","v":47},{"$f":"LON1_","v":71.14},null,null,null,null,null,null,{"$f":"Sight2!LAT2_","v":47},{"$f":"Sight2!LON2_","v":71.648333333333326},null,null,null,null,null,null,{"$f":"Sight3!LAT3_","v":47},{"$f":"Sight3!LON3_","v":71.203333333333333}]
["Running:","Speed(kt)","Course","DT(hr)","(min)","(sec)","DT (decimal)",null,"Running:","Speed(kt)","Course","DT(hr)","(min)","(sec)","DT (decimal)",null,"Running:","Speed(kt)","Course","DT(hr)","(min)","(sec)","DT (decimal)"]
[null,0,0,0,0,0,{"$f":"D37+(E37/60)+(F37/3600)","v":0},null,null,0,0,0,0,0,{"$f":"L37+(M37/60)+(N37/3600)","v":0},null,null,0,0,0,0,0,{"$f":"T37+(U37/60)+(V37/3600)","v":0}]
["RLAT1","RLON1",null,"DRLat1","DRLon1",null,null,null,"RLAT2","RLON2",null,"DRLat2","DRLon2",null,null,null,"RLAT3","RLON3",null,"DRLat3","DRLon3"]
[{"$f":"LAT1_+DRLat1","v":47},{"$f":"LON1_+DRLon1","v":71.14},null,{"$f":"Speed1*DT1_*SIN(RADIANS(Course1+90))/60","v":0},{"$f":"Speed1*DT1_*COS(RADIANS(Course1+90))/(60*COS(RADIANS(LAT1_)))","v":0},null,null,null,{"$f":"Sight2!LAT2_+DRLat2","v":47},{"$f":"Sight2!LON2_+DRLon2","v":71.648333333333326},null,{"$f":"Speed2*DT2_*SIN(RADIANS(Course2+90))/60","v":0},{"$f":"Speed2*DT2_*COS(RADIANS(Course2+90))/(60*COS(RADIANS(Sight2!LAT2_)))","v":0},null,null,null,{"$f":"Sight3!LAT3_+DRLat3","v":47},{"$f":"Sight3!LON3_+DRLon3","v":71.203333333333333},null,{"$f":"Speed3*DT3_*SIN(RADIANS(Course3+90))/60","v":0},{"$f":"Speed3*DT3_*COS(RADIANS(Course3+90))/(60*COS(RADIANS(Sight3!LAT3_)))","v":0}]
[]
[{"$f":"body1","v":"Arcturus"},null,null,null,null,null,null,null,{"$f":"body2","v":"Saturne"},null,null,null,null,null,null,null,{"$f":"body3","v":"Altaïr"}]
["DEC1","GHA1",null,"UT1",null,null,null,null,"DEC2","GHA2",null,"UT2",null,null,null,null,"DEC3","GHA3",null,"UT3"]
[{"$f":"DEC1_","v":19.248333333333335},{"$f":"GHA1_","v":135.14023150966665},null,{"$f":"hr1_","v":2},{"$f":"min1_","v":50},{"$f":"sec1_","v":44},null,null,{"$f":"Sight2!DEC2_","v":-21.098333333333333},{"$f":"Sight2!GHA2_","v":96.648510185185188},null,{"$f":"Sight2!hr2_","v":2},{"$f":"Sight2!min2_","v":56},{"$f":"Sight2!sec2_","v":47},null,null,{"$f":"Sight3!DEC3_","v":8.8333333333333339},{"$f":"Sight3!GHA3_","v":53.203657439666642},null,{"$f":"Sight3!hr3_","v":2},{"$f":"Sight3!min3_","v":58},{"$f":"Sight3!sec3_","v":4}]
[null,{"$f":"IF(GHA1_>180,GHA1_-360,GHA1_)","v":135.14023150966665},null,null,null,null,null,null,null,{"$f":"IF(Sight2!GHA2_>180,Sight2!GHA2_-360,Sight2!GHA2_)","v":96.648510185185188},null,null,null,null,null,null,null,{"$f":"IF(Sight3!GHA3_>180,Sight3!GHA3_-360,Sight3!GHA3_)","v":53.203657439666642}]
["Plot of the azimuth line of body 1, from the assumed pos.",null,null,null,null,null,null,null,"Plot of the azimuth line of body 2, from the assumed pos.",null,null,null,null,null,null,null,"Plot of the azimuth line of body 3, from the assumed pos."]
["Azimuth1",null,"length","x","y",null,null,null,"Azimuth2",null,"length","x","y",null,null,null,"Azimuth3",null,"length","x","y"]
[{"$f":"AZ_nord1","v":264.75810790555602},null,1,{"$f":"RLON1_+C47*COS(RADIANS((A47+90)))/COS(RADIANS(LAT1_))","v":72.600147009553908},{"$f":"RLAT1_+C47*SIN(RADIANS(A47+90))","v":46.90863929825646},null,null,null,{"$f":"Sight2!AZ_nord2","v":204.53240535865166},null,1,{"$f":"RLON2_+K47*COS(RADIANS(I47+90))/COS(RADIANS(Sight2!LAT2_))","v":72.257143935671891},{"$f":"RLAT2_+K47*SIN(RADIANS(I47+90))","v":46.090273416939276},null,null,null,{"$f":"Sight3!AZ_nord3","v":152.33978530454002},null,1,{"$f":"RLON3_+S47*COS(RADIANS(Q47+90))/COS(RADIANS(Sight3!LAT3_))","v":70.522646755137643},{"$f":"RLAT3_+S47*SIN(RADIANS(Q47+90))","v":46.114283808588077}]
[null,null,null,{"$f":"RLON1_-C47*COS(RADIANS((A47+90)))/COS(RADIANS(LAT1_))","v":69.679852990446093},{"$f":"RLAT1_-C47*SIN(RADIANS(A47+90))","v":47.09136070174354},null,null,null,null,null,null,{"$f":"RLON2_-K47*COS(RADIANS((I47+90)))/COS(RADIANS(Sight2!LAT2_))","v":71.039522730994761},{"$f":"RLAT2_-K47*SIN(RADIANS(I47+90))","v":47.909726583060724},null,null,null,null,null,null,{"$f":"RLON3_-S47*COS(RADIANS((Q47+90)))/COS(RADIANS(Sight3!LAT3_))","v":71.884019911529023},{"$f":"RLAT3_-S47*SIN(RADIANS(Q47+90))","v":47.885716191411923}]
[]
[]
["Calc. Altitude (Hc1)",null,null,"Obs. Altitude (Ho1)",null,null,null,null,"Calc. Altitude (Hc2)",null,null,"Obs. Altitude (Ho2)",null,null,null,null,"Calc. Altitude (Hc3)",null,null,"Obs. Altitude (Ho3)"]
[{"$f":"HC1_","v":31.557481434887862},null,null,{"$f":"HO1_","v":31.708087791759795},null,null,null,null,{"$f":"Sight2!HC2_","v":18.264218153153848},null,null,{"$f":"Sight2!HO2_","v":18.311848543694897},null,null,null,null,{"$f":"Sight3!HC3_","v":48.87132015937074},null,null,{"$f":"Sight3!HO3_","v":48.942588356885622}]
[]
["Altitude difference",null,null,"Distance to body (nmi, deg, rad)",null,null,null,null,"Altitude difference",null,null,"Distance to body (nmi, deg, rad)",null,null,null,null,"Altitude difference",null,null,"Distance to body (nmi, deg, rad)"]
[{"$f":"D52-A52","v":0.15060635687193269},null,null,{"$f":"IF(LonB1=LonLP1,IF(LatB1-LatLP1<0,-(90-D52)*60,(90-D52)*60),IF((LonB1-LonLP1)<0,-(90-D52)*60,(90-D52)*60))","v":3497.5147324944123},{"$f":"D55/60","v":58.291912208240205},{"$f":"RADIANS(E55)","v":1.01738579531727},null,null,{"$f":"L52-I52","v":4.7630390541048229E-2},null,null,{"$f":"IF(LonB2=LonLP2,IF(LatB2-LatLP2<0,-(90-L52)*60,(90-L52)*60),IF((LonB2-LonLP2)<0,-(90-L52)*60,(90-L52)*60))","v":4301.2890873783062},{"$f":"L55/60","v":71.688151456305107},{"$f":"RADIANS(M55)","v":1.251194277580892},null,null,{"$f":"T52-Q52","v":7.1268197514882559E-2},null,null,{"$f":"IF(LonB3=LonLP3,IF(LatB3-LatLP3<0,-(90-T52)*60,(90-T52)*60),IF((LonB3-LonLP3)<0,-(90-T52)*60,(90-T52)*60))","v":-2463.4446985868626},{"$f":"T55/60","v":-41.057411643114378},{"$f":"RADIANS(U55)","v":-0.71658701551900095}]
["Distance from  AP to COP1 (nmi)",null,null,null,null,null,null,null,"Distance from  AP to COP2 (nmi)",null,null,null,null,null,null,null,null,null,null,"Distance from  AP to COP3 (nmi)"]
[{"$f":"A55*60","v":9.0363814123159614},null,null,null,null,null,null,null,{"$f":"I55*60","v":2.8578234324628937},null,null,null,null,null,null,null,null,null,null,{"$f":"Q55*60","v":4.2760918508929535}]
[]
["Position of COP1 on azimuth line (your position for meridian sight)",null,null,null,null,null,null,null,"Position of COP2 on azimuth line",null,null,null,null,null,null,null,"Position of COP3 on azimuth line"]
[null,"(decimal)",null,null,null,null,null,null,null,"(decimal)",null,null,null,null,null,null,null,"(decimal)"]
["LatLP1",{"$f":"DRLat1+LatLP1","v":46.98624049754914},{"$f":"IF(ABS(LAT1_+A55*SIN(RADIANS(90+A47)))<0.000000000001,0,LAT1_+A55*SIN(RADIANS(90+A47)))","v":46.98624049754914},null,null,null,null,null,"LatLP2",{"$f":"DRLat2+LatLP2","v":46.956669367563244},{"$f":"IF(ABS(Sight2!LAT2_+I55*SIN(RADIANS(90+I47)))<0.000000000001,0,Sight2!LAT2_+I55*SIN(RADIANS(90+I47)))","v":46.956669367563244},null,null,null,null,null,"LatLP3",{"$f":"DRLat3+LatLP3","v":46.936876603528326},{"$f":"IF(ABS(Sight3!LAT3_+Q55*SIN(RADIANS(90+Q47)))<0.000000000001,0,Sight3!LAT3_+Q55*SIN(RADIANS(90+Q47)))","v":46.936876603528326}]
["LonLP1",{"$f":"DRLon1+LonLP1","v":71.359907421606366},{"$f":"IF(ABS(LON1_+(A55/COS(RADIANS(LAT1_)))*COS(RADIANS(90+A47)))<0.000000000001,0,LON1_+(A55/COS(RADIANS(LAT1_)))*COS(RADIANS(90+A47)))","v":71.359907421606366},null,null,null,null,null,"LonLP2",{"$f":"DRLon2+LonLP2","v":71.677331220088249},{"$f":"IF(ABS(Sight2!LON2_+(I55/COS(RADIANS(Sight2!LAT2_)))*COS(RADIANS(90+I47)))<0.000000000001,0,Sight2!LON2_+(I55/COS(RADIANS(Sight2!LAT2_)))*COS(RADIANS(90+I47)))","v":71.677331220088249},null,null,null,null,null,"LonLP3",{"$f":"DRLon3+LonLP3","v":71.154822027832751},{"$f":"IF(ABS(Sight3!LON3_+(Q55/COS(RADIANS(Sight3!LAT3_)))*COS(RADIANS(90+Q47)))<0.000000000001,0,Sight3!LON3_+(Q55/COS(RADIANS(Sight3!LAT3_)))*COS(RADIANS(90+Q47)))","v":71.154822027832751}]
[]
["Plot of body 1 circle of position (COP1)",null,null,null,null,null,null,null,"Plot of body 2 circle of position (COP2)",null,null,null,null,null,null,null,"Plot of body 3 circle of position (COP3)"]
[0.2,null,null,null,null,null,null,null,0.2,null,null,null,null,null,null,null,0.2]
[]
[]
[]
[]
[]
[]
["Positioning star indicator on Az line 1",null,null,null,null,null,null,null,"Positioning star indicator on Az line 2",null,null,null,null,null,null,null,"Positioning star indicator on Az line 3"]
["-Tan (Az)","Dx","Dy","X*","Y*",null,null,null,"-Tan (Az)","Dx","Dy","X*","Y*",null,null,null,"-Tan (Az)","Dx","Dy","X*","Y*"]
[{"$f":"IF(OR(AZN1_<0.01,AZN1_>359.99),0.001,IF((ABS(AZN1_-180))<0.01,0.001,-TAN(RADIANS(AZN1_))))","v":-10.899849136024558},{"$f":"IF(AZN1_>180,xmax-RLON1_,xmin-RLON1_)","v":0.92627918563961487},{"$f":"B74/A74*COS(RADIANS(Latc))","v":-5.7956846712526884E-2},{"$f":"RLON1_+B74","v":72.066279185639615},{"$f":"RLAT1_+C74","v":46.942043153287472},null,null,null,{"$f":"IF(OR(AZN2_<0.01,AZN2_>359.99),0.001,IF((ABS(AZN2_-180))<0.01,0.001,-TAN(RADIANS(AZN2_))))","v":-0.45640947523663372},{"$f":"IF(AZN2_>180,xmax-RLON2_,xmin-RLON2_)","v":0.41794585230628911},{"$f":"J74/I74*COS(RADIANS(Latc))","v":-0.62452337502421285},{"$f":"RLON2_+J74","v":72.066279185639615},{"$f":"RLAT2_+K74","v":46.375476624975789},null,null,null,{"$f":"IF(OR(AZN3_<0.01,AZN3_>359.99),0.001,IF((ABS(AZN3_-180))<0.01,0.001,-TAN(RADIANS(AZN3_))))","v":0.52412627718365179},{"$f":"IF(AZN3_>180,xmax-RLON3_,xmin-RLON3_)","v":-0.60333333333333883},{"$f":"R74/Q74*COS(RADIANS(Latc))","v":-0.78506337464206088},{"$f":"RLON3_+R74","v":70.599999999999994},{"$f":"RLAT3_+S74","v":46.214936625357936}]
[null,{"$f":"IF(AND(OR(AZN1_>270,AZN1_<=90),E74>ymax),C75*A74/COS(RADIANS(Latc)),IF(AND(AND(AZN1_>90,AZN1_<=270),E74<ymin),C75*A74/COS(RADIANS(Latc)),B74))","v":0.92627918563961487},{"$f":"IF(AND(OR(AZN1_>270,AZN1_<=90),E74>ymax),ymax-RLAT1_,IF(AND(AND(AZN1_>90,AZN1_<=270),E74<ymin),ymin-RLAT1_,C74))","v":-5.7956846712526884E-2},{"$f":"RLON1_+B75","v":72.066279185639615},{"$f":"RLAT1_+C75","v":46.942043153287472},null,null,null,null,{"$f":"IF(AND(OR(AZN2_>270,AZN2_<=90),M74>ymax),K75*I74/COS(RADIANS(Latc)),IF(AND(AND(AZN2_>90,AZN2_<=270),M74<ymin),K75*I74/COS(RADIANS(Latc)),J74))","v":0.40153422820090889},{"$f":"IF(AND(OR(AZN2_>270,AZN2_<=90),M74>ymax),ymax-RLAT2_,IF(AND(AND(AZN2_>90,AZN2_<=270),M74<ymin),ymin-RLAT2_,K74))","v":-0.60000000000000142},{"$f":"RLON2_+J75","v":72.049867561534242},{"$f":"RLAT2_+K75","v":46.4},null,null,null,null,{"$f":"IF(AND(OR(AZN3_>270,AZN3_<=90),U74>ymax),S75*Q74/COS(RADIANS(Latc)),IF(AND(AND(AZN3_>90,AZN3_<=270),U74<ymin),S75*Q74/COS(RADIANS(Latc)),R74))","v":-0.46110927052870504},{"$f":"IF(AND(OR(AZN3_>270,AZN3_<=90),U74>ymax),ymax-RLAT3_,IF(AND(AND(AZN3_>90,AZN3_<=270),U74<ymin),ymin-RLAT3_,S74))","v":-0.60000000000000142},{"$f":"RLON3_+R75","v":70.742224062804624},{"$f":"RLAT3_+S75","v":46.4}]

{"sheet":"data","index":4,"n_rows":9,"n_cols":12,"rows_kept":9,"cut":false,"hidden":true,"merged":[]}
[null,"ChBox15 (COP1)",null,"ChBox16 (COP2)",null,"ChBox17 (COP3)",null,"ChBox1 (Sight1)",null,"ChBox1 (Sight2)",null,"ChBox1 (Sight3)"]
["status",true,null,true,null,true,null,false,null,false,null,false]
[]
[null,null,"deg","min"]
["Lon1","W",71,8.4]
[]
["Lon2","W",71,38.9]
[]
["Lon3","W",71,12.2]

{"sheet":"CALC1","index":5,"n_rows":182,"n_cols":48,"rows_kept":182,"cut":false,"hidden":true,"merged":[]}
["Plot of local meridian circle",null,null,null,"Plot of LHA meridian",null,null,null,null,null,"Plot of North AZIMUT",null,null,"Plot of the EQUATOR",null,null,"South Pole view",null,null,"Declination circle",null,null,null,"Zenith view",null,null,"Altitude circle",null,null,null,"Plot of circle of position (COP1) for body 1",null,null,null,null,null,"slope and offset for linear approx. at Lat or Lon near intersection (n=0: x=my+b; n=1: y=mx+b)"]
[0,{"$f":"COS(RADIANS(A2))","v":1},{"$f":"SIN(RADIANS(A2))","v":0},null,90,{"$f":"COS(RADIANS(E2))*COS(RADIANS(LHA1_))","v":2.6853264191137649E-17},{"$f":"SIN(RADIANS(E2))","v":1},{"$f":"F2*COS(RADIANS(90-LAT1_))-G2*SIN(RADIANS(90-LAT1_))","v":-0.68199836006249848},{"$f":"F2*SIN(RADIANS(90-LAT1_))+G2*COS(RADIANS(90-LAT1_))","v":0.73135370161917046},null,{"$f":"COS(RADIANS(E2))*COS(RADIANS(AZ_nord1-180))","v":5.5965211290232724E-18},null,null,{"$f":"1.1*COS(RADIANS(90-LAT1_))","v":0.80448907178108753},{"$f":"1.1*SIN(RADIANS(90-LAT1_))","v":0.75019819606874838},null,0,0,null,0,{"$f":"COS(RADIANS(DEC1_))*COS(RADIANS(T2))","v":0.94409861030547937},{"$f":"COS(RADIANS(DEC1_))*SIN(RADIANS(T2))","v":0},null,0,0,null,0,{"$f":"COS(RADIANS(HC1_))*COS(RADIANS(AA2))","v":0.85211554373915199},{"$f":"COS(RADIANS(HC1_))*SIN(RADIANS(AA2))","v":0},null,"Azimut from body to PLOP1 (great circle)",null,null,null,null,null,"m","b","n"]
[{"$f":"SUM(A2+2)","v":2},0.99939082701909576,3.4899496702500969E-2,null,{"$f":"SUM(E2-2)","v":88},{"$f":"COS(RADIANS(E3))*COS(RADIANS(LHAo1_))","v":1.5298805648167739E-2},0.99939082701909576,-0.67039406694738757,0.74134194106762508,null,3.1884425092368633E-3,null,null,{"$f":"1.1*COS(RADIANS(270-LAT1_))","v":-0.80448907178108764},{"$f":"1.1*SIN(RADIANS(270-LAT1_))","v":-0.75019819606874827},null,null,null,null,{"$f":"SUM(T2+2)","v":2},0.94352349094077204,{"$f":"COS(RADIANS(DEC1_))*SIN(RADIANS(T3))","v":3.2948566337191822E-2},null,null,null,null,{"$f":"SUM(AA2+2)","v":2},0.85159645797329753,2.9738403608874354E-2,null,"acos","AZ(deg)",null,null,null,"LOP1:",0.13864715277387213,64.845573991166702,0]
[4,0.9975640502598242,6.9756473744125302E-2,null,86,3.0578972058253412E-2,0.9975640502598242,-0.65797300192799102,0.75042696955586041,null,6.373000392418113E-3,null,null,null,null,null,"Zénith",null,null,4,0.94179883354100535,6.5856989921639353E-2,null,"North Pole",null,null,4,0.85003983310178088,5.9440575553801209E-2,null,{"$f":"ACOS(IF(AG4>0,IF((ABS(1-AG4))<0.000000000001,1,AG4),IF((ABS(1+AG4))<0.000000000001,-1,AG4)))","v":0.80287524599997273},{"$f":"DEGREES(AE4)","v":46.001363071326168},{"$f":"(SIN(RADIANS(LatLP1))-(SIN(RADIANS(LatB1))*SIN(RADIANS(HO1_))))/(COS(RADIANS(LatB1))*COS(RADIANS(HO1_)))","v":0.69464125710916769}]
[6,0.99452189536827329,0.10452846326765347,null,84,4.582188270121576E-2,0.99452189536827329,-0.64475029815871654,0.75859771837610535,null,9.5497937563066761E-3,null,null,"Plot of POLES",null,null,0,{"$f":"COS(RADIANS(LAT1_))","v":0.68199836006249848},null,6,0.93892673933555815,9.8685176908358985E-2,null,0,{"$f":"COS(RADIANS(LAT1_))","v":0.68199836006249848},null,6,0.84744756563222823,8.9070328313534508E-2,null,"Azimut North from body to PLOP1 (rad-deg)"]
[8,0.99026806874157036,0.13917310096006544,null,82,6.1008966438426605E-2,0.99026806874157036,-0.63074206546730549,0.76584423272952951,null,1.2714952167536138E-2,null,null,{"$f":"1.1*COS(RADIANS(180-LAT1_))","v":-0.75019819606874827},{"$f":"1.1*SIN(RADIANS(180-LAT1_))","v":0.80448907178108764},null,null,null,null,8,0.93491070752880745,0.13139313120830196,null,null,null,null,8,0.8438228138432432,0.11859156259845005,null,{"$f":"IF(AND(LatB1=0,LatLP1=0),IF((LonLP1-LonB1)>0,3*PI()/2,PI()/2),IF(LonLP1=LonB1,IF((LatLP1-LatB1)>0,0,PI()),IF((LonLP1-LonB1)<0,AE4,2*PI()-AE4)))","v":0.80287524599997273},{"$f":"IF(DEGREES(ZB1Nr)>=360,DEGREES(ZB1Nr)-360,IF(LonLP1-LonB1>180,DEGREES(2*PI()-ZB1Nr),IF(LonLP1-LonB1<-180,DEGREES(2*PI()-ZB1Nr),DEGREES(ZB1Nr))))","v":46.001363071326168}]
[10,0.98480775301220802,0.17364817766693033,null,80,7.6121720147743085E-2,0.98480775301220802,-0.61596537072748936,0.77215768385463324,null,1.5864619368137694E-2,null,null,{"$f":"1.1*COS(RADIANS(-LAT1_))","v":0.75019819606874838},{"$f":"1.1*SIN(RADIANS(-LAT1_))","v":-0.80448907178108753},null,"Zénith line + label",null,"nadir",10,0.92975563103688741,0.16394100321742791,null,"Z meridian",null,null,10,0.83916999393653013,0.14796831133196922,null,"D","acosLatv","LatV","cs/sndLov","ifdLov","dLoV","DV","DVx","asindLovx","dLoVx","AzNB-LOP","Latx","DRLatx","GHAx","GHAxcor","DRLonx","linLat1","linLon1"]
[12,0.97814760073380569,0.20791169081775934,null,78,9.1141731266711642E-2,0.97814760073380558,-0.60043821706563372,0.77753037978373341,null,1.899495797379645E-2,null,null,null,null,null,0,0,null,12,0.9234677905264248,0.1962891383673091,null,0,-1,null,12,0.83349477465643373,0.17716478347090145,null,{"$f":"IF(AO8=0,RADIANS(90-HO1_),IF(AO8=180,-RADIANS(90-HO1_),IF(AO8<180,-RADIANS(90-HO1_),RADIANS(90-HO1_))))","v":-1.01738579531727},{"$f":"ACOS(COS(RADIANS(LatB1))*SIN(RADIANS(AO8)))","v":0.87122451717639404},{"$f":"IF(OR(AO8=0,AO8=180),RADIANS((LatLP1+LatB1)/2),IF(AND(LatB1=0,LatLP1=0),0,IF(LatB1>=0,AF8,-AF8)))","v":0.87122451717639404},{"$f":"IF(COS(RADIANS(AO8))/SIN(AG8)>0,IF(1-COS(RADIANS(AO8))/SIN(AG8)<0.000000000001,1,COS(RADIANS(AO8))/SIN(AG8)),IF(1+COS(RADIANS(AO8))/SIN(AG8)<0.000000000001,-1,COS(RADIANS(AO8))/SIN(AG8)))","v":0.95584930702332926},{"$f":"IF(AND(AO8<=180,AO8>0),IF(AH8=1,-PI()/2,IF(AH8=-1,PI()/2,-ASIN(AH8))),IF(AH8=1,PI()/2,IF(AH8=-1,-PI()/2,ASIN(AH8))))","v":-1.2725365282042098},{"$f":"IF(OR(OR(AO8=0,AO8=180),AND(LatB1<>LatLP1,OR(AO8=90,AO8=270))),0,IF(AND(LatB1=0,LatLP1=0),RADIANS((LonLP1-LonB1)/2),AI8))","v":-1.2725365282042098},{"$f":"IF(AJ8=0,AG8-RADIANS(LatB1),ASIN(COS(RADIANS(LatB1))*SIN(AJ8)))","v":-1.1253443179401739},{"$f":"AE8-AK8","v":0.10795852262290384},{"$f":"ASIN(SIN(AL8)/COS(RADIANS(AP8)))","v":0.16675737818840997},{"$f":"IF(AL8>PI()/2,PI()-AM8,IF(AL8<-PI()/2,-PI()-AM8,AM8))","v":0.16675737818840997},{"$f":"IF(AO9-dZB1_<0,360+(AO9-dZB1_),IF(AO9-dZB1_>=360,AO9-dZB1_-360,AO9-dZB1_))","v":43.001363071326125},{"$f":"IF(OR(AO8=0,AO8=180),LatB1+DEGREES(AE8),DEGREES(ASIN(SIN(AG8)*COS(AL8))))","v":49.522730190919013},{"$f":"DRLat1+AP8","v":49.522730190919013},{"$f":"IF(OR(LatB1=90,LatB1=-90),AR9-dZB1_,IF(OR(AO8=0,AO8=180),LonB1,LonB1+DEGREES(AJ8)+DEGREES(AN8)))","v":71.783753140197788},{"$f":"IF(AR8<0,360+AR8,AR8)","v":71.783753140197788},{"$f":"IF(AS8-GHAx1>180,cLOP1+(AS8-GHAx1-360),IF(AS8-GHAx1<-180,cLOP1+(AS8-GHAx1+360),cLOP1+(AS8-GHAx1)))","v":71.783753140197788},null,71.711759529726294]
[14,0.97029572627599647,0.24192189559966773,null,76,0.10605070022543908,0.97029572627599647,-0.58417952192670064,0.78195577471444055,null,2.2102154149113089E-2,null,null,"Plot of Declination",null,null,0,1,null,14,0.91605484676251403,0.22839812543811358,null,0,1,null,14,0.82680407038344617,0.20614540761131722,null,-1.01738579531727,0.86807544662086911,0.86807544662086911,{"$f":"IF(COS(RADIANS(AO9))/SIN(AG9)>0,IF(1-COS(RADIANS(AO9))/SIN(AG9)<0.000000000001,1,COS(RADIANS(AO9))/SIN(AG9)),IF(1+COS(RADIANS(AO9))/SIN(AG9)<0.000000000001,-1,COS(RADIANS(AO9))/SIN(AG9)))","v":0.95526827359740507},{"$f":"IF(AND(AO9<=180,AO9>0),IF(AH9=1,-PI()/2,IF(AH9=-1,PI()/2,-ASIN(AH9))),IF(AH9=1,PI()/2,IF(AH9=-1,-PI()/2,ASIN(AH9))))","v":-1.2705655808274681},-1.2705655808274681,-1.12407286972442,{"$f":"AE9-AK9","v":0.10668707440714997},0.16421159951182437,{"$f":"IF(AL9>PI()/2,PI()-AM9,IF(AL9<-PI()/2,-PI()-AM9,AM9))","v":0.16421159951182437},43.201363071326128,49.353936091880442,49.353936091880442,71.750817732784725,{"$f":"IF(AR9<0,360+AR9,AR9)","v":71.750817732784725},71.750817732784725,null,71.688356708489579]
[16,0.96126169593831889,0.27563735581699916,null,74,0.12083046274179995,0.96126169593831889,-0.56720909402625685,0.78542847698471141,null,2.5182422254174903E-2,null,null,{"$f":"COS(RADIANS(DEC1_+90-LAT1_))","v":0.46564026337497105},{"$f":"SIN(RADIANS(DEC1_+90-LAT1_))","v":0.88497409291124884},null,0,1.1000000000000001,-1.1000000000000001,16,0.9075258312752551,0.26022884457510587,null,null,null,null,16,0.81910603271009996,0.23487487532682436,null,-1.01738579531727,0.86492830213359995,0.86492830213359995,0.95468039279486105,-1.2685840950876686,-1.2685840950876686,-1.1227898631772488,0.1054040678599788,0.16166748515540044,0.16166748515540044,43.401363071326131,49.185093892041579,49.185093892041579,71.718581487618863,71.718581487618863,71.718581487618863,null,71.66494721821384]
[18,0.95105651629515353,0.3090169943749474,null,72,0.13546301195181593,0.95105651629515353,-0.54954760921660517,0.78794425564175852,null,2.823200945677479E-2,null,null,{"$f":"COS(RADIANS(270-DEC1_-LAT1_))","v":-0.91529976330588314},{"$f":"SIN(RADIANS(270-DEC1_-LAT1_))","v":-0.40277331501999269},null,null,null,null,18,0.89789113535622489,0.29174251495016396,null,"Azimut line + label",null,null,18,0.81041004050950838,0.26331818418644676,null,-1.01738579531727,0.86178310643275102,0.86178310643275102,0.95408557183301501,-1.2665919532459569,-1.2665919532459569,-1.121495186865155,0.10410939154788501,0.15912478641375283,0.15912478641375283,43.601363071326134,49.016204670796448,49.016204670796448,71.687036900870723,71.687036900870723,71.687036900870723,null,71.641531208553999]
[20,0.93969262078590843,0.34202014332566871,null,70,0.14993052034824597,0.93969262078590832,-0.53121658529644267,0.7895000455968143,null,3.1247200304659273E-2,null,null,null,null,null,"LHA line + label",null,null,20,0.88716249739829001,0.32290074201024471,null,0,0,null,20,0.80072668850865314,0.2914406803996949,null,-1.01738579531727,0.85863988254482748,0.85863988254482748,0.9534837163624803,-1.2645890361098673,-1.2645890361098673,-1.1201887278713896,0.10280293255411954,0.15658325525039299,0.15658325525039299,43.801363071326136,48.84726949317502,48.84726949317502,71.656176590321593,71.656176590321593,71.656176590321593,null,71.618108827173444]
[22,0.92718385456678742,0.37460659341591201,null,68,0.1642153615006578,0.92718385456678742,-0.51223835579473886,0.79009395135946958,null,3.4224321252234735E-2,null,null,"Plot of Calculated ALTITUDE",null,null,0,0,null,22,0.87535298859418165,0.35366556425523227,null,{"$f":"COS(RADIANS(90-AZ_nord1))","v":-0.99581786596592448},{"$f":"SIN(RADIANS(90-AZ_nord1))","v":-9.136070174354019E-2},null,22,0.79006777438034093,0.31920810103687131,null,-1.01738579531727,0.85549865380988777,0.85549865380988777,0.95287473043787718,-1.2625752230118406,-1.2625752230118406,-1.118870371774713,0.10148457645744302,0.154042644237638,0.154042644237638,44.001363071326139,48.678289410139911,48.678289410139911,71.625993293151367,71.625993293151367,71.625993293151367,null,71.594680219785133]
[24,0.91354545764260087,0.40673664307580021,null,66,0.17830013153051846,0.91354545764260087,-0.49263604276076883,0.7897252493470367,null,3.7159745136216914E-2,null,null,{"$f":"COS(RADIANS(HC1_))","v":0.85211554373915199},{"$f":"SIN(RADIANS(HC1_))","v":0.52335370459960373},null,{"$f":"COS(RADIANS(90+LHA1_))","v":-0.89879581757688676},{"$f":"SIN(RADIANS(90+LHA1_))","v":0.43836751511294236},null,24,0.86247699701126268,0.38399949948817874,null,{"$f":"1.1*COS(RADIANS(90-AZ_nord1))","v":-1.0953996525625169},{"$f":"1.1*SIN(RADIANS(90-AZ_nord1))","v":-0.10049677191789422},null,24,0.77844628436955732,0.3465866157731729,null,-1.01738579531727,0.85235944388685081,0.85235944388685081,0.95225851648795168,-1.2605503917874248,-1.2605503917874248,-1.1175400026278355,0.10015420731056546,0.1515027064970168,0.1515027064970168,44.201363071326142,48.50926545887642,48.50926545887642,71.596479863773112,71.596479863773112,71.596479863773112,null,71.57124553019186]
[26,0.89879404629916704,0.4383711467890774,null,64,0.19216767031513896,0.89879404629916704,-0.47243352859345994,0.78839438876612356,null,4.0049895594770554E-2,null,null,{"$f":"COS(RADIANS(180-HC1_))","v":-0.85211554373915221},{"$f":"SIN(RADIANS(180-HC1_))","v":0.5233537045996034},null,{"$f":"1.1*COS(RADIANS(90+LHA1_))","v":-0.98867539933457549},{"$f":"1.1*SIN(RADIANS(90+LHA1_))","v":0.48220426662423665},null,26,0.84855021006188225,0.41386559048158728,null,null,null,null,26,0.76587637747172732,0.37354286810573029,null,-1.01738579531727,0.84922227675890538,0.84922227675890538,0.95163497528509167,-1.2585144187531538,-1.2585144187531538,-1.1161975029355318,9.8811707618261746E-2,0.1489631956401434,0.1489631956401434,44.401363071326145,48.340198663076272,48.340198663076272,71.567629271712789,71.567629271712789,71.567629271712789,null,71.547804900325573]
[28,0.88294759285892699,0.46947156278589081,null,62,0.20580108239464087,0.88294759285892688,-0.45165542694436622,0.78610299106534465,null,4.2891251424755444E-2,null,null,null,null,null,null,null,null,28,0.83358959539068112,0.44322745000410113,null,null,null,null,28,0.75237336818215994,0.40004401599336875,null,-1.01738579531727,0.84608717673901934,0.84608717673901934,0.95100400591422873,-1.2564671786841062,-1.2564671786841062,-1.1148427536324335,9.7456958315163433E-2,0.14642386571003921,0.14642386571003921,44.601363071326148,48.171090033214782,48.171090033214782,71.539434599533081,71.539434599533081,71.539434599533081,null,71.524358470285776]
[30,0.86602540378443871,0.49999999999999994,null,60,0.21918375755647143,0.8660254037844386,-0.43032705272972599,0.7828538479598357,null,4.5680350871770067E-2,null,null,"Zénith",null,null,"Greenwich line + label",null,null,30,0.81761338020213026,0.47204930515273963,null,"Cardinal points",null,null,30,0.73795370783769565,0.42605777186957594,null,-1.01738579531727,0.8429541684755526,0.8429541684755526,0.95036550574111089,-1.2544085447911304,-1.2544085447911304,-1.1134756340604859,9.6089838743215861E-2,0.14388447112287553,0.14388447112287553,44.801363071326151,48.001940566822171,48.001940566822171,71.511889040800327,71.511889040800327,71.511889040800327,null,71.500906378377223]
[32,0.84804809615642596,0.5299192642332049,null,58,0.23229939107238895,0.84804809615642596,-0.40847439128813556,0.77865091802997866,null,4.8413795847766061E-2,null,null,0,1.2,null,0,0,null,32,0.80064102905348933,0.5002960409366709,null,-1.1499999999999999,0,"W",32,0.72263496457328558,0.45155244197992878,null,-1.01738579531727,0.83982327695797598,0.83982327695797598,0.94971937037993892,-1.2523383886977482,-1.2523383886977482,-1.1120960219460829,9.4710226628812899E-2,0.14134476661013731,0.14134476661013731,45.001363071326153,47.832751248748757,47.832751248748757,71.484985898094195,71.484985898094195,71.484985898094195,null,71.47744876114659]
[34,0.82903757255504162,0.5591929034707469,null,56,0.24513200356326292,0.82903757255504174,-0.38612406672141703,0.77349932189848125,null,5.1088256071095121E-2,null,null,null,null,null,{"$f":"COS(RADIANS(90-LON1_))","v":0.94631126527200526},{"$f":"SIN(RADIANS(90-LON1_))","v":0.32325684713443664},null,34,0.78269322014024278,0.52793324305941824,null,0,1.1499999999999999,"N",34,0.70643580191792599,0.47649696499605065,null,-1.01738579531727,0.83669452752269835,0.83669452752269835,0.94906549366034554,-1.2502565804167096,-1.2502565804167096,-1.1107037933768495,9.3317998059579521E-2,0.13880450716114956,0.13880450716114956,45.201363071326156,47.663523051424349,47.663523051424349,71.458718581057852,71.458718581057852,71.458718581057852,null,71.453985753418507]
[36,0.80901699437494745,0.58778525229247314,null,54,0.25766596046748558,0.80901699437494745,-0.36330330945725131,0.76740533599168725,null,5.3700473123944117E-2,null,null,"Horizon",null,null,{"$f":"-COS(RADIANS(90-LON1_))","v":-0.94631126527200526},{"$f":"-SIN(RADIANS(90-LON1_))","v":-0.32325684713443664},null,36,0.7637918201029037,0.55492723984737946,null,1.1499999999999999,0,"E",36,0.68937595605602286,0.50086094985905538,null,-1.01738579531727,0.83356794585900162,0.83356794585900162,0.94840376759371625,-1.2481629883262275,-1.2481629883262275,-1.1092988227781049,9.1913027460834851E-2,0.13626344796600104,0.13626344796600104,45.401363071326159,47.494256935111899,47.494256935111899,71.433080604489533,71.433080604489533,71.433080604489533,null,71.430517488330693]
[38,0.7880107536067219,0.61566147532565829,null,52,0.26988599108927713,0.78801075360672201,-0.34003992307309666,0.76037638489271731,null,5.6247264422215351E-2,null,null,1.3,0,null,{"$f":"1.1*COS(RADIANS(90-LON1_))","v":1.0409423917992058},{"$f":"1.1*SIN(RADIANS(90-LON1_))","v":0.35558253184788036},null,38,0.74395985738587966,0.58124514327357513,null,0,-1.1499999999999999,"S",38,0.67147621178189076,0.52461471280637184,null,-1.01738579531727,0.83044355801509084,0.83044355801509084,0.94773408233882517,-1.2460574791458532,-1.2460574791458532,-1.1078809828889598,9.0495187571689728E-2,0.13372134435878238,0.13372134435878238,45.601363071326162,47.324953848155864,47.324953848155864,71.408065586472418,71.408065586472418,71.408065586472418,null,71.407044097368413]
[40,0.76604444311897801,0.64278760968653925,null,50,0.28177720720367638,0.76604444311897801,-0.31636225042181221,0.75242103229575885,null,5.8725527093015005E-2,null,null,-1.3,0,null,{"$f":"-1.1*COS(RADIANS(90-LON1_))","v":-1.0409423917992058},{"$f":"-1.1*SIN(RADIANS(90-LON1_))","v":-0.35558253184788036},null,40,0.72322149418086201,0.60685488902664264,null,null,null,null,40,0.65275837717668383,0.54772931353683518,null,-1.01738579531727,0.8273213904042559,0.8273213904042559,0.94705632616678437,-1.2439399179120167,-1.2439399179120167,-1.1064501447380835,8.9064349420813427E-2,0.13117795176117561,0.13117795176117561,45.801363071326165,47.15561472722483,47.15561472722483,71.383667246544078,71.383667246544078,71.383667246544078,null,71.383565710398102]
[42,0.74314482547739424,0.66913060635885824,null,48,0.29332512119554932,0.74314482547739424,-0.29229913910025768,0.74354897057252289,null,6.1132241755025796E-2,null,null,null,null,null,null,null,null,42,0.7016019969889159,0.63172527557626079,null,"Azimut North 1",null,null,42,0.63324525703860701,0.57017659046998692,null,-1.01738579531727,0.82420146981115183,0.82420146981115183,0.94637038542528729,-1.241810167953217,-1.241810167953217,-1.1050061776191142,8.7620382301844213E-2,0.12863302562634593,0.12863302562634593,{"$f":"IF(ZB1N>=360,ZB1N-360,ZB1N)","v":46.001363071326168},46.986240497549133,46.986240497549133,{"$f":"IF(OR(LatB1=90,LatB1=-90),LonLP1,IF(OR(AO23=0,AO23=180),LonB1,LonB1+DEGREES(AJ23)+DEGREES(AN23)))","v":71.359879403903179},71.359879403903179,{"$f":"IF(DRLon1+LON1_<0,DRLon1+GHAx1-360,DRLon1+GHAx1)","v":71.359879403903179},null,71.360082455700294]
[44,0.71933980033865119,0.69465837045899725,null,46,0.30451566371051664,0.71933980033865108,-0.26787990630294023,0.73377100896358316,null,6.3464476197158046E-2,null,null,"N",null,null,"Sun line + label",null,null,44,0.67912770583714155,0.65582600218740816,null,{"$f":"AZ_nord1","v":264.75810790555602},null,null,44,0.6129606250987828,0.59192919505662167,null,-1.01738579531727,0.82108382339819674,0.82108382339819674,0.94567614450213311,-1.2396680908648574,-1.2396680908648574,-1.1035489490657144,8.616315374844441E-2,0.12608632138312131,0.12608632138312131,{"$f":"IF(AO23+dZB1_<0,360+(AO23+dZB1_),IF(AO23+dZB1_>=360,AO23+dZB1_-360,AO23+dZB1_))","v":46.20136307132617},46.81683207315325,46.81683207315325,{"$f":"IF(OR(LatB1=90,LatB1=-90),AR23+dZB1_,IF(OR(AO24=0,AO24=180),LonB1,LonB1+DEGREES(AJ24)+DEGREES(AN24)))","v":71.336695975653029},71.336695975653029,{"$f":"IF(AS24-GHAx1>180,cLOP1+(AS24-GHAx1-360),IF(AS24-GHAx1<-180,cLOP1+(AS24-GHAx1+360),cLOP1+(AS24-GHAx1)))","v":71.336695975653029},null,71.336594460001891]
[46,0.69465837045899725,0.71933980033865108,null,44,0.3153352007962949,0.69465837045899725,-0.24313430310352899,0.72309906040898042,null,6.5719388950997215E-2,null,null,"S",null,null,0,0,null,46,0.65582600218740816,0.67912770583714144,null,null,null,null,46,0.59192919505662167,0.61296062509878269,null,-1.01738579531727,0.81796847871209266,0.81796847871209266,0.94497348578801976,-1.2375135464837268,-1.2375135464837268,-1.1020783248262702,8.4692529509000192E-2,0.12353759438044952,0.12353759438044952,46.401363071326173,46.647390357083289,46.647390357083289,71.31411097508132,71.31411097508132,71.31411097508132,null,71.313101848507685]
[48,0.66913060635885824,0.74314482547739424,null,42,0.32577055051356685,0.66913060635885824,-0.21809247820775443,0.71154612703414089,null,6.7894232752695391E-2,null,null,"E",null,null,{"$f":"COS(RADIANS(270-LON1_+UTday1*360))","v":-0.47649396626198098},{"$f":"SIN(RADIANS(270-LON1_+UTday1*360))","v":-0.87917774091245404},null,48,0.63172527557626079,0.7016019969889159,null,null,null,null,48,0.57017659046998692,0.63324525703860701,null,-1.01738579531727,0.81485546369046857,0.81485546369046857,0.94426228963859193,-1.2353463928621253,-1.2353463928621253,-1.1005941688382335,8.3208373520963441E-2,0.12098659983211428,0.12098659983211428,46.601363071326176,46.477916241629423,46.477916241629423,71.292118509975083,71.292118509975083,71.292118509975083,null,71.289604744931125]
[50,0.64278760968653936,0.76604444311897801,null,40,0.33580899899614441,0.64278760968653925,-0.19278494122185463,0.69912628430878865,null,6.9986357890089237E-2,null,null,"W",null,null,{"$f":"1.1*COS(RADIANS(270-LON1_+UTday1*360))","v":-0.52414336288817909},{"$f":"1.1*SIN(RADIANS(270-LON1_+UTday1*360))","v":-0.9670955150036995},null,50,0.60685488902664275,0.72322149418086201,null,null,null,null,50,0.54772931353683529,0.65275837717668383,null,-1.01738579531727,0.81174480666865068,0.81174480666865068,0.94354243433572749,-1.2331664862416238,-1.2331664862416238,-1.0990963432020961,8.1710547884826124E-2,0.11843309276168568,0.11843309276168568,46.801363071326179,46.308410608543781,46.308410608543781,71.270712780970072,71.270712780970072,71.270712780970072,null,71.266103271524671]
[52,0.61566147532565829,0.78801075360672201,null,38,0.34543831594085606,0.61566147532565829,-0.16724252548131979,0.68585466389815486,null,7.1993215430965998E-2,null,null,"f",null,null,null,null,null,52,0.58124514327357513,0.74395985738587977,null,null,null,null,52,0.52461471280637184,0.67147621178189087,null,-1.01738579531727,0.80863653638656197,0.80863653638656197,0.9428137960480506,-1.2309736810264624,-1.2309736810264624,-1.097584708155003,8.019891283773295E-2,0.11587682794769996,0.11587682794769996,47.001363071326182,46.138874329253568,46.138874329253568,71.24988807993391,71.24988807993391,71.24988807993391,null,71.242597549109206]
[54,0.58778525229247314,0.80901699437494745,null,36,0.35464676950828727,0.58778525229247314,-0.14149635048522191,0.67174743522737301,null,7.3912360328544854E-2,null,null,"s",null,null,"GHAy line + label",null,null,54,0.55492723984737946,0.7637918201029037,null,null,null,null,54,0.50086094985905538,0.68937595605602286,null,-1.01738579531727,0.80553068199575206,0.80553068199575206,0.94207624879065543,-1.2287678297565792,-1.2287678297565792,-1.0960591220439904,7.8673326726720338E-2,0.11331755986904078,0.11331755986904078,47.201363071326185,45.969308265069728,45.969308265069728,71.229638788382076,71.229638788382076,71.229638788382076,null,71.219087697103049]
[56,0.55919290347074679,0.82903757255504174,null,34,0.36342314061621961,0.5591929034707469,-0.11557778398189988,0.65682178578152672,null,7.5741454400389666E-2,null,null,"U",null,null,0,0,null,56,0.52793324305941813,0.7826932201402429,null,null,null,null,56,0.47649696499605054,0.7064358019179261,null,-1.01738579531727,0.80242727306656203,0.80242727306656203,0.94132966438402721,-1.226548783080271,-1.226548783080271,-1.0945194412988588,7.7133645981588783E-2,0.11075504265051954,0.11075504265051954,47.401363071326188,45.79971326739124,45.79971326739124,71.209959375926189,71.209959375926189,71.209959375926189,null,71.195573833550228]
[58,0.5299192642332049,0.84804809615642596,null,32,0.3717567366083544,0.5299192642332049,-8.9518403752188613E-2,0.64109590016534557,null,7.7478269177124262E-2,null,null,"L",null,null,{"$f":"COS(RADIANS(90-LON1_+GHAy1))","v":0.99080641661254443},{"$f":"SIN(RADIANS(90-LON1_+GHAy1))","v":0.13528726769141647},null,58,0.5002960409366709,0.80064102905348933,null,null,null,null,58,0.45155244197992878,0.72263496457328558,null,-1.01738579531727,0.79932633959542532,0.79932633959542532,0.94057391241214394,-1.2243163897264808,-1.2243163897264808,-1.0929655204046658,7.5579725087395744E-2,0.1081890300086252,0.1081890300086252,47.60136307132619,45.630090177904989,45.630090177904989,71.190844398753683,71.190844398753683,71.190844398753683,null,71.172056075148262]
[60,0.50000000000000011,0.8660254037844386,null,30,0.37963740428166726,0.49999999999999994,-6.3349959136758338E-2,0.62458893794806603,null,7.9120688617479007E-2,null,null,"ft",null,null,{"$f":"1.15*COS(RADIANS(90-LON1_+GHAy1))","v":1.139427379104426},{"$f":"1.15*SIN(RADIANS(90-LON1_+GHAy1))","v":0.15558035784512891},null,60,0.4720493051527398,0.81761338020213015,null,null,null,null,60,0.42605777186957611,0.73795370783769554,null,-1.01738579531727,0.79622791201230869,0.79622791201230869,0.93980886017974496,-1.2220704964767062,-1.2220704964767062,-1.0913972118738458,7.4011416556575726E-2,0.1056192751974423,0.1056192751974423,47.801363071326193,45.460439828781581,45.460439828781581,71.172288498138457,71.172288498138457,71.172288498138457,null,71.148534537275196]
[62,0.46947156278589086,0.88294759285892688,null,28,0.38705554225652211,0.46947156278589081,-3.7104332354433112E-2,0.60732101032044716,null,8.0666711686361123E-2,null,null,"m",null,null,null,null,null,62,0.44322745000410119,0.83358959539068112,null,null,null,null,62,0.40004401599336881,0.75237336818215983,null,-1.01738579531727,0.7931320211882944,0.7931320211882944,0.93903437266875345,-1.2198109481365416,-1.2198109481365416,-1.0898143662179525,7.2428570900682443E-2,0.10304553095471848,0.10304553095471848,48.001363071326196,45.290763042866935,45.290763042866935,71.154286398981512,71.154286398981512,71.154286398981512,null,71.125009334016312]
[64,{"$f":"COS(RADIANS(A34))","v":0.43837114678907746},{"$f":"SIN(RADIANS(A34))","v":0.89879404629916704},null,26,0.39400211267447305,{"$f":"SIN(RADIANS(E34))","v":0.4383711467890774},{"$f":"F34*COS(RADIANS(90-LAT1_))-G34*SIN(RADIANS(90-LAT1_))","v":-1.081349965861822E-2},{"$f":"F34*SIN(RADIANS(90-LAT1_))+G34*COS(RADIANS(90-LAT1_))","v":0.58931315559238284},null,{"$f":"COS(RADIANS(E34))*COS(RADIANS(AZ_nord1-180))","v":8.2114454792807795E-2},null,null,null,null,null,"Horizontal axis",null,null,64,{"$f":"COS(RADIANS(DEC1_))*COS(RADIANS(T34))","v":0.41386559048158733},0.84855021006188225,null,null,null,null,64,{"$f":"COS(RADIANS(HC1_))*COS(RADIANS(AA34))","v":0.37354286810573034},{"$f":"COS(RADIANS(HC1_))*SIN(RADIANS(AA34))","v":0.76587637747172732},null,-1.01738579531727,0.79003869844330954,0.79003869844330954,0.9382503124938304,-1.2175375875068226,-1.2175375875068226,-1.0882168319190115,7.0831036601741504E-2,0.10046754944805508,0.10046754944805508,48.201363071326199,45.121060633870151,45.121060633870151,71.136832908381024,71.136832908381024,71.136832908381024,null,71.101480578190049]
[{"$f":"SUM(A34+2)","v":66},0.40673664307580021,0.91354545764260087,null,{"$f":"SUM(E34-2)","v":24},{"$f":"COS(RADIANS(E35))*COS(RADIANS(LHAo1_))","v":0.40046865220950306},0.40673664307580021,1.5490507620838756E-2,0.57058731356096204,null,8.3462154084851525E-2,null,null,null,null,null,-1.3,0,null,{"$f":"SUM(T34+2)","v":66},0.38399949948817874,{"$f":"COS(RADIANS(DEC1_))*SIN(RADIANS(T35))","v":0.86247699701126268},null,null,null,null,{"$f":"SUM(AA34+2)","v":66},0.3465866157731729,0.77844628436955732,null,-1.01738579531727,0.78694797555400031,0.78694797555400031,0.93745653985705479,-1.215250255354408,-1.215250255354408,-1.0866044554005017,6.9218660083231631E-2,9.7885082221234598E-2,9.7885082221234598E-2,48.401363071326202,44.951333406547135,44.951333406547135,71.119922914231282,71.119922914231282,71.119922914231282,null,71.077948381373503]
[68,0.37460659341591196,0.92718385456678742,null,22,0.40644728237928268,0.37460659341591201,4.1775642102889476E-2,0.55116629878020484,null,8.4708167598502151E-2,null,null,null,null,null,1.3,0,null,68,0.35366556425523221,0.87535298859418165,null,null,null,null,68,0.31920810103687125,0.79006777438034093,null,-1.01738579531727,0.78385988476175927,0.78385988476175927,0.93665291250170579,-1.2129487903825655,-1.2129487903825655,-1.0849770809979422,6.7591285680672186E-2,9.5297880140644192E-2,9.5297880140644192E-2,48.601363071326205,44.781582156880688,44.781582156880688,71.103551383849762,71.103551383849762,71.103551383849762,null,71.054412853927445]
[70,0.34202014332566882,0.93969262078590832,null,20,0.41193071914388751,0.34202014332566871,6.800987940008224E-2,0.53107377276504397,null,8.5850977258226935E-2,null,null,null,null,null,null,null,null,70,0.32290074201024482,0.8871624973982899,null,null,null,null,70,0.29144068039969501,0.80072668850865303,null,-1.01738579531727,0.78077445878090623,0.78077445878090623,0.93583928566513541,-1.2106330292009762,-1.2106330292009762,-1.0833345509290986,6.5948755611828558E-2,9.2705693341801176E-2,9.2705693341801176E-2,48.801363071326207,44.611807672256795,44.611807672256795,71.087713362631831,71.087713362631831,71.087713362631831,null,71.030874105020686]
[72,0.30901699437494745,0.95105651629515353,null,18,0.41691228178027839,0.3090169943749474,9.4161257135344817E-2,0.51033421516341226,null,8.688919072649183E-2,null,null,null,null,null,"Hour marks",null,null,72,0.29174251495016401,0.89789113535622489,null,null,null,null,72,0.26331818418644681,0.81041004050950838,null,-1.01738579531727,0.77769173080702436,0.77769173080702436,0.93501551203071731,-1.2083028062953585,-1.2083028062953585,-1.0816767052637997,6.429090994652964E-2,9.0108271175961679E-2,9.0108271175961679E-2,49.00136307132621,44.442010731637289,44.442010731637289,71.07240397273209,71.07240397273209,71.07240397273209,null,71.007332242654087]
[74,0.27563735581699916,0.96126169593831889,null,16,0.42138590102173401,0.27563735581699916,0.12019791388321771,0.48897289393156362,null,8.7821543100110311E-2,null,0,{"$f":"COS(RADIANS(90+M39))","v":6.1257422745431001E-17},{"$f":"SIN(RADIANS(90+M39))","v":1},0,{"$f":"COS(RADIANS(90+P39))","v":6.1257422745431001E-17},{"$f":"SIN(RADIANS(90+P39))","v":1},null,74,0.26022884457510587,0.9075258312752551,null,null,null,null,74,0.23487487532682436,0.81910603271009996]
[76,0.24192189559966767,0.97029572627599647,null,14,0.42534612645231662,0.24192189559966773,0.14608812798809315,0.46701583454895956,null,8.8646898451332959E-2,null,{"$f":"SUM(M39+5)","v":5},{"$f":"COS(RADIANS(90+M40))","v":-8.7155742747658235E-2},{"$f":"SIN(RADIANS(90+M40))","v":0.99619469809174555},{"$f":"SUM(P39+15)","v":15},{"$f":"COS(RADIANS(90+P40))","v":-0.25881904510252085},{"$f":"SIN(RADIANS(90+P40))","v":0.96592582628906831},null,76,0.22839812543811353,0.91605484676251403,null,null,null,null,76,0.20614540761131719,0.82680407038344617,null,"For testing (and removing) potential ambiguities, using great-circle equations"]
[78,0.20791169081775945,0.97814760073380558,null,12,0.42878813314736525,0.20791169081775934,0.17180035621216622,0.44448978831023211,null,8.9364251211800583E-2,null,{"$f":"SUM(M40+5)","v":10},-0.1736481776669303,0.98480775301220802,{"$f":"SUM(P40+15)","v":30},-0.49999999999999978,0.86602540378443871,null,78,0.19628913836730918,0.92346779052642469,null,null,null,null,78,0.17716478347090156,0.83349477465643373,null,"Lat1","Lon1","Lat2","Lon2","ZN","D","Latv","Cos/SinDlov","DLov","Dv","Dvx","DLovx","Latx","Lonx"]
[80,0.17364817766693041,0.98480775301220802,null,10,0.43170772755192227,0.17364817766693033,0.19730327216601082,0.42142219973285178,null,8.9972727397674257E-2,null,15,-0.25881904510252085,0.96592582628906831,45,-0.70710678118654746,0.70710678118654757,null,80,0.16394100321742799,0.92975563103688741,null,null,null,null,80,0.14796831133196928,0.83916999393653013,null,60,-50,43,132,{"$f":"DEGREES(ACOS((SIN(RADIANS(AG42))-(SIN(RADIANS(AE42))*SIN(RADIANS(90-ABS(AJ44)))))/(COS(RADIANS(AE42))*COS(RADIANS(90-ABS(AJ44))))))","v":1.5011287694027318},{"$f":"DEGREES(ACOS(SIN(RADIANS(AE42))*SIN(RADIANS(AG42))+COS(RADIANS(AE42))*COS(RADIANS(AG42))*COS(RADIANS(AH42-AF42))))","v":76.986900694651823},{"$f":"DEGREES(ACOS(COS(RADIANS(AE42))*SIN(RADIANS(AI44))))","v":89.249500018466094},{"$f":"COS(RADIANS(AI44))/SIN(RADIANS(AK43))","v":0.99974257368060848},{"$f":"DEGREES(ASIN(AL42))","v":88.69990999071662},{"$f":"DEGREES(ASIN(COS(RADIANS(AE42))*SIN(RADIANS(AM44))))","v":-29.991484771194305},{"$f":"AJ44-AN43","v":-46.995415923457514},{"$f":"DEGREES(ASIN(SIN(RADIANS(AO42))/COS(RADIANS(AQ42))))","v":-89.300090009282869},{"$f":"DEGREES(ASIN(SIN(RADIANS(AK43))*COS(RADIANS(AO42))))","v":43.000000000000007},{"$f":"IF(AF42=AH42,AF42,AF42+AM44+AP43)","v":-227.99999999999949}]
[82,0.13917310096006547,0.99026806874157036,null,8,0.43410135258993499,0.13917310096006544,0.22256580447496049,0.39784117312021045,null,9.04715856744501E-2,null,20,-0.34202014332566871,0.93969262078590843,60,-0.86602540378443871,0.49999999999999994,null,82,0.13139313120830198,0.93491070752880745,null,null,null,null,82,0.11859156259845008,0.8438228138432432,null,null,null,null,null,{"$f":"IF(AND(AE42=0,AG42=0),IF(AH42-AF42>0,270,90),IF(AF42=AH42,IF(AG42-AE42>=0,0,180),IF(AI42<0,180+AI42,IF(AH42-AF42<0,AI42,360-AI42))))","v":358.49887123059727},{"$f":"IF(AF42=AH42,IF(AG42-AE42<0,-AJ42,AJ42),IF(AH42-AF42<0,-AJ42,AJ42))","v":76.986900694651823},{"$f":"IF(OR(AI44=0,AI44=180),(AE42+AG42)/2,IF(AND(AE42=0,AG42=0),0,IF(AE42>=0,AK42,-AK42)))","v":89.249500018466094},null,{"$f":"IF(AND(AI44<=180,AI44>0),IF(AL42=1,-90,IF(AL42=-1,90,-DEGREES(ASIN(AL42)))),IF(AL42=1,90,IF(AL42=-1,-90,DEGREES(ASIN(AL42)))))","v":-88.69990999071662},{"$f":"IF(AM44=0,AK43-AE42,AN42)","v":-29.991484771194305},null,{"$f":"IF(AO42>90,180-AP42,IF(AO42<-90,-AP42-180,AP42))","v":-89.300090009282869},{"$f":"IF(AF42=AH42,AE42+AJ43,AQ42)","v":43.000000000000007},{"$f":"IF(AR42>=360,AR42-360,IF(AR42>180,AR42-360,IF(AR42<-180,AR42+360,AR42)))","v":132.00000000000051}]
[84,0.10452846326765346,0.99452189536827329,null,6,0.43596609199800401,0.10452846326765347,0.24755717463479127,0.37377543832085697,null,9.0860218260161038E-2,null,25,-0.42261826174069933,0.90630778703665005,75,-0.9659258262890682,0.25881904510252102,null,84,9.8685176908358971E-2,0.93892673933555815,null,null,null,null,84,8.9070328313534508E-2,0.84744756563222823,null,null,null,null,null,{"$f":"IF(AH42-AF42>180,360-AI43,IF(AH42-AF42<-180,360-AI43,AI43))","v":1.501128769402726},{"$f":"IF(ABS(AH42-AF42)>180,-AJ43,AJ43)","v":-76.986900694651823},null,null,{"$f":"IF(OR(AF42=AH42,AND(AE42<>AG42,OR(AI44=90,AI44=270))),0,IF(AND(AE42=0,AG42=0),(AH42-AF42)/2,AM43))","v":-88.69990999071662}]
[86,6.9756473744125233E-2,0.9975640502598242,null,4,0.43729967387840185,6.9756473744125302E-2,0.27224693451058907,0.349254315725602,null,9.1138151665865669E-2,null,30,-0.49999999999999978,0.86602540378443871,90,-1,1.22514845490862E-16,null,86,6.5856989921639297E-2,0.94179883354100535,null,null,null,null,86,5.9440575553801153E-2,0.85003983310178088]
[88,3.489949670250108E-2,0.99939082701909576,null,2,0.43810047346702979,3.4899496702500969E-2,0.29660500343311119,0.32430768054513853,null,9.1305047272521506E-2,null,35,-0.57357643635104616,0.81915204428899169,105,-0.96592582628906831,-0.25881904510252079,null,88,3.2948566337191933E-2,0.94352349094077204,null,null,null,null,88,2.9738403608874451E-2,0.85159645797329753]
[90,6.1257422745431001E-17,1,null,0,0.43836751511294275,0,0.32060170484744832,0.2989659264116995,null,9.1360701743540121E-2,null,40,-0.64278760968653936,0.76604444311897801,120,-0.8660254037844386,-0.50000000000000011,null,90,5.7833047684856674E-17,0.94409861030547937,null,null,null,null,90,5.2198402090782036E-17,0.85211554373915199]
[92,-3.4899496702500955E-2,0.99939082701909576,null,-2,0.43810047346702979,-3.4899496702500969E-2,0.34420780246933563,0.27325992834909835,null,9.1305047272521506E-2,null,45,-0.70710678118654746,0.70710678118654757,135,-0.70710678118654768,-0.70710678118654746,null,92,-3.2948566337191815E-2,0.94352349094077204,null,null,null,null,92,-2.9738403608874343E-2,0.85159645797329753]
[94,-6.975647374412533E-2,0.9975640502598242,null,-4,0.43729967387840185,-6.9756473744125302E-2,0.36739453590506149,0.24722100515626896,null,9.1138151665865669E-2,null,50,-0.7660444431189779,0.64278760968653947,150,-0.50000000000000044,-0.86602540378443837,null,94,-6.5856989921639381E-2,0.94179883354100535,null,null,null,null,94,-5.9440575553801236E-2,0.85003983310178088]
[96,-0.10452846326765355,0.99452189536827329,null,-6,0.43596609199800401,-0.10452846326765347,0.39013365569157682,0.22088088125013322,null,9.0860218260161038E-2,null,55,-0.81915204428899191,0.57357643635104594,165,-0.25881904510252063,-0.96592582628906831,null,96,-9.8685176908359068E-2,0.93892673933555815,null,null,null,null,96,-8.9070328313534591E-2,0.84744756563222823]
[98,-0.13917310096006535,0.99026806874157036,null,-8,0.43410135258993499,-0.13917310096006544,0.41239745771411479,0.1942716480142857,null,9.04715856744501E-2,null,60,-0.86602540378443871,0.49999999999999994,180,-1.83772268236293E-16,-1,null,98,-0.13139313120830187,0.93491070752880745,null,null,null,null,98,-0.11859156259844998,0.8438228138432432]
[100,-0.1736481776669303,0.98480775301220802,null,-10,0.43170772755192227,-0.17364817766693033,0.43415881695938652,0.16742572470058603,null,8.9972727397674257E-2,null,65,-0.90630778703664994,0.4226182617406995,195,0.2588190451025203,-0.96592582628906842,null,100,-0.16394100321742788,0.92975563103688741,null,null,null,null,100,-0.14796831133196919,0.83916999393653013]
[102,-0.20791169081775934,0.97814760073380569,null,-12,0.42878813314736525,-0.20791169081775934,0.45539122056323239,0.14037581893129455,null,8.9364251211800583E-2,null,70,-0.93969262078590832,0.34202014332566888,210,0.50000000000000011,-0.8660254037844386,null,102,-0.1962891383673091,0.9234677905264248,null,null,null,null,102,-0.17716478347090145,0.83349477465643373]
[104,-0.24192189559966779,0.97029572627599647,null,-14,0.42534612645231662,-0.24192189559966773,0.47606880011246189,0.11315488684987254,null,8.8646898451332959E-2,null,75,-0.9659258262890682,0.25881904510252102,225,0.70710678118654735,-0.70710678118654768,null,104,-0.22839812543811361,0.91605484676251403,null,null,null,null,104,-0.20614540761131728,0.82680407038344617]
[106,-0.27563735581699905,0.96126169593831889,null,-16,0.42138590102173401,-0.27563735581699916,0.49616636316153134,8.579609296899815E-2,null,8.7821543100110311E-2,null,80,-0.98480775301220802,0.17364817766693028,240,0.86602540378443837,-0.50000000000000044,null,106,-0.26022884457510576,0.9075258312752551,null,null,null,null,106,-0.23487487532682425,0.81910603271009996]
[108,-0.30901699437494734,0.95105651629515364,null,-18,0.41691228178027839,-0.3090169943749474,0.51565942392565767,5.8332769764715992E-2,null,8.688919072649183E-2,null,85,-0.99619469809174555,8.7155742747658194E-2,255,0.96592582628906831,-0.25881904510252068,null,108,-0.2917425149501639,0.897891135356225,null,null,null,null,108,-0.2633181841864467,0.81041004050950849]
[110,-0.34202014332566871,0.93969262078590843,null,-20,0.41193071914388751,-0.34202014332566871,0.53452423311297581,3.07983770659499E-2,null,8.5850977258226935E-2,null,90,-1,1.22514845490862E-16,270,1,-2.45029690981724E-16,null,110,-0.32290074201024471,0.88716249739829001,null,null,null,null,110,-0.2914406803996949,0.80072668850865314]
[112,-0.37460659341591207,0.92718385456678742,null,-22,0.40644728237928268,-0.37460659341591201,0.55273780685939178,3.2264612888551758E-3,null,8.4708167598502151E-2,null,95,-0.99619469809174555,-8.7155742747657944E-2,285,0.96592582628906842,0.25881904510252024,null,112,-0.35366556425523232,0.87535298859418165,null,null,null,null,112,-0.31920810103687136,0.79006777438034093]
[114,-0.40673664307580026,0.91354545764260087,null,-24,0.40046865220950306,-0.40673664307580021,0.57027795473088183,-2.4349385434321691E-2,null,8.3462154084851525E-2,null,100,-0.98480775301220802,-0.17364817766693047,300,0.8660254037844386,0.5,null,114,-0.3839994994881788,0.86247699701126268,null,null,null,null,114,-0.34658661577317296,0.77844628436955732]
[116,-0.43837114678907751,0.89879404629916693,null,-26,0.39400211267447305,-0.4383711467890774,0.58712330675911695,-5.1895566182082131E-2,null,8.2114454792807795E-2,null,105,-0.96592582628906831,-0.25881904510252079,315,0.70710678118654768,0.70710678118654735,null,116,-0.41386559048158739,0.84855021006188214,null,null,null,null,116,-0.3735428681057304,0.76587637747172721]
[118,-0.46947156278589092,0.88294759285892688,null,-28,0.38705554225652211,-0.46947156278589081,0.6032533394774785,-7.9378520176348888E-2,null,8.0666711686361123E-2,null,110,-0.93969262078590843,-0.34202014332566866,330,0.49999999999999972,0.86602540378443882,null,118,-0.44322745000410124,0.83358959539068112,null,null,null,null,118,-0.40004401599336886,0.75237336818215983]
[120,-0.49999999999999978,0.86602540378443871,null,-30,0.37963740428166726,-0.49999999999999994,0.61864840092574003,-0.10676476367110438,null,7.9120688617479007E-2,null,115,-0.90630778703665005,-0.42261826174069927,345,0.25881904510252074,0.96592582628906831,null,120,-0.47204930515273946,0.81761338020213026,null,null,null,null,120,-0.42605777186957583,0.73795370783769565]
[122,-0.52991926423320479,0.84804809615642607,null,-32,0.3717567366083544,-0.5299192642332049,0.63328973459295446,-0.1340209307471778,null,7.7478269177124262E-2,null,120,-0.8660254037844386,-0.50000000000000011,null,null,null,null,122,-0.50029604093667079,0.80064102905348944,null,null,null,null,122,-0.45155244197992866,0.72263496457328569]
[124,-0.55919290347074668,0.82903757255504174,null,-34,0.36342314061621961,-0.5591929034707469,0.64715950226937291,-0.16111381396347765,null,7.5741454400389666E-2,null,125,-0.8191520442889918,-0.57357643635104616,null,null,null,null,124,-0.52793324305941802,0.7826932201402429,null,null,null,null,124,-0.47649696499605043,0.7064358019179261]
[126,-0.58778525229247303,0.80901699437494745,null,-36,0.35464676950828727,-0.58778525229247314,0.66024080577955524,-0.18801040481514342,null,7.3912360328544854E-2,null,130,-0.76604444311897801,-0.64278760968653925,null,null,null,null,126,-0.55492723984737935,0.7637918201029037,null,null,null,null,126,-0.50086094985905527,0.68937595605602286]
[128,{"$f":"COS(RADIANS(A66))","v":-0.61566147532565829},{"$f":"SIN(RADIANS(A66))","v":0.78801075360672201},null,-38,0.34543831594085606,{"$f":"SIN(RADIANS(E66))","v":-0.61566147532565829},{"$f":"F66*COS(RADIANS(90-LAT1_))-G66*SIN(RADIANS(90-LAT1_))","v":0.67251770757019491},{"$f":"F66*SIN(RADIANS(90-LAT1_))+G66*COS(RADIANS(90-LAT1_))","v":-0.21467793394932472},null,{"$f":"COS(RADIANS(E66))*COS(RADIANS(AZ_nord1-180))","v":7.1993215430965998E-2},null,135,-0.70710678118654768,-0.70710678118654746,null,null,null,null,128,{"$f":"COS(RADIANS(DEC1_))*COS(RADIANS(T66))","v":-0.58124514327357513},0.74395985738587977,null,null,null,null,128,{"$f":"COS(RADIANS(HC1_))*COS(RADIANS(AA66))","v":-0.52461471280637184},{"$f":"COS(RADIANS(HC1_))*SIN(RADIANS(AA66))","v":0.67147621178189087}]
[{"$f":"SUM(A66+2)","v":130},-0.64278760968653936,0.76604444311897801,null,{"$f":"SUM(E66-2)","v":-40},{"$f":"COS(RADIANS(E67))*COS(RADIANS(LHAo1_))","v":0.33580899899614441},-0.64278760968653925,0.68397525012757165,-0.24108391108958932,null,6.9986357890089237E-2,null,140,-0.64278760968653947,-0.7660444431189779,null,null,null,null,130,-0.60685488902664275,{"$f":"COS(RADIANS(DEC1_))*SIN(RADIANS(T67))","v":0.72322149418086201},null,null,null,null,130,-0.54772931353683529,0.65275837717668383]
[132,-0.66913060635885824,0.74314482547739424,null,-42,0.32577055051356685,-0.66913060635885824,0.69459947420097856,-0.26719616462032114,null,6.7894232752695391E-2,null,145,-0.57357643635104638,-0.81915204428899158,null,null,null,null,132,-0.63172527557626079,0.7016019969889159,null,null,null,null,132,-0.57017659046998692,0.63324525703860701]
[134,-0.69465837045899737,0.71933980033865108,null,-44,0.3153352007962949,-0.69465837045899725,0.7043774358099183,-0.29298288078287693,null,6.5719388950997215E-2,null,150,-0.50000000000000044,-0.86602540378443837,null,null,null,null,134,-0.65582600218740827,0.67912770583714144,null,null,null,null,134,-0.59192919505662178,0.61296062509878269]
[136,-0.71933980033865119,0.69465837045899714,null,-46,0.30451566371051664,-0.71933980033865108,0.71329722201434997,-0.31841264243575185,null,6.3464476197158046E-2,null,155,-0.42261826174069916,-0.90630778703665005,null,null,null,null,136,-0.67912770583714155,0.65582600218740805,null,null,null,null,136,-0.6129606250987828,0.59192919505662167]
[138,-0.74314482547739402,0.66913060635885835,null,-48,0.29332512119554932,-0.74314482547739424,0.72134796542877133,-0.34345446733152646,null,6.1132241755025796E-2,null,160,-0.34202014332566855,-0.93969262078590843,null,null,null,null,138,-0.70160199698891568,0.6317252755762609,null,null,null,null,138,-0.63324525703860679,0.57017659046998703]
[140,-0.7660444431189779,0.64278760968653947,null,-50,0.28177720720367638,-0.76604444311897801,0.72851985746245362,-0.36807784586396253,null,5.8725527093015005E-2,null,165,-0.25881904510252063,-0.96592582628906831,null,null,null,null,140,-0.7232214941808619,0.60685488902664275,null,null,null,null,140,-0.65275837717668372,0.5477293135368354]
[142,-0.7880107536067219,0.6156614753256584,null,-52,0.26988599108927713,-0.78801075360672201,0.7348041602696993,-0.39225277823925919,null,5.6247264422215351E-2,null,170,-0.17364817766693033,-0.98480775301220802,null,null,null,null,142,-0.74395985738587966,0.58124514327357524,null,null,null,null,142,-0.67147621178189076,0.52461471280637195]
[144,-0.80901699437494734,0.58778525229247325,null,-54,0.25766596046748558,-0.80901699437494745,0.7401932173955601,-0.41594981102617973,null,5.3700473123944117E-2,null,175,-8.7155742747658249E-2,-0.99619469809174555,null,null,null,null,144,-0.76379182010290358,0.55492723984737957,null,null,null,null,144,-0.68937595605602275,0.50086094985905549]
[146,-0.82903757255504162,0.5591929034707469,null,-56,0.24513200356326292,-0.82903757255504174,0.74468046310404912,-0.43914007304052161,null,5.1088256071095121E-2,null,180,-1.83772268236293E-16,-1,null,null,null,null,146,-0.78269322014024278,0.52793324305941824,null,null,null,null,146,-0.70643580191792599,0.47649696499605065]
[148,-0.84804809615642596,0.5299192642332049,null,-58,0.23229939107238895,-0.84804809615642596,0.74826043037747747,-0.46179531052020606,null,4.8413795847766061E-2,null,185,8.7155742747657888E-2,-0.99619469809174555,null,null,null,null,148,-0.80064102905348933,0.5002960409366709,null,null,null,null,148,-0.72263496457328558,0.45155244197992878]
[150,-0.86602540378443871,0.49999999999999994,null,-60,0.21918375755647143,-0.8660254037844386,0.75092875757717437,-0.4838879215481362,null,4.5680350871770067E-2,null,190,0.17364817766692997,-0.98480775301220813,null,null,null,null,150,-0.81761338020213026,0.47204930515273963,null,null,null,null,150,-0.73795370783769565,0.42605777186957594]
[152,-0.88294759285892699,0.46947156278589069,null,-62,0.20580108239464087,-0.88294759285892688,0.75268219375747125,-0.50539098968088025,null,4.2891251424755444E-2,null,195,0.2588190451025203,-0.96592582628906842,null,null,null,null,152,-0.83358959539068112,0.44322745000410102,null,null,null,null,152,-0.75237336818215994,0.4000440159933687]
[154,-0.89879404629916704,0.43837114678907729,null,-64,0.19216767031513896,-0.89879404629916704,0.75351860262647841,-0.52627831674221226,null,4.0049895594770554E-2,null,200,0.34202014332566899,-0.93969262078590832,null,null,null,null,154,-0.84855021006188225,0.41386559048158716,null,null,null,null,154,-0.76587637747172732,0.37354286810573023]
[156,-0.91354545764260076,0.40673664307580043,null,-66,0.17830013153051846,-0.91354545764260087,0.75343696514882819,-0.54652445474155387,null,3.7159745136216914E-2,null,205,0.42261826174069961,-0.90630778703664994,null,null,null,null,156,-0.86247699701126257,0.38399949948817896,null,null,null,null,156,-0.77844628436955721,0.34658661577317307]
[158,-0.92718385456678731,0.37460659341591224,null,-68,0.1642153615006578,-0.92718385456678742,0.75243738078721145,-0.56610473687843155,null,3.4224321252234735E-2,null,210,0.50000000000000011,-0.8660254037844386,null,null,null,null,158,-0.87535298859418165,0.35366556425523249,null,null,null,null,158,-0.79006777438034081,0.31920810103687147]
[160,-0.93969262078590832,0.34202014332566888,null,-70,0.14993052034824597,-0.93969262078590832,0.75052106738119873,-0.58499530759517271,null,3.1247200304659273E-2,null,215,0.57357643635104605,-0.8191520442889918,null,null,null,null,160,-0.8871624973982899,0.32290074201024488,null,null,null,null,160,-0.80072668850865303,0.29144068039969501]
[162,-0.95105651629515353,0.30901699437494751,null,-72,0.13546301195181593,-0.95105651629515353,0.74769035966349007,-0.60317315164122831,null,2.823200945677479E-2,null,220,0.64278760968653925,-0.76604444311897812,null,null,null,null,162,-0.89789113535622489,0.29174251495016407,null,null,null,null,162,-0.81041004050950838,0.26331818418644687]
[164,-0.96126169593831889,0.27563735581699922,null,-74,0.12083046274179995,-0.96126169593831889,0.74394870641540223,-0.62061612211371064,null,2.5182422254174903E-2,null,225,0.70710678118654735,-0.70710678118654768,null,null,null,null,164,-0.9075258312752551,0.26022884457510592,null,null,null,null,164,-0.81910603271009996,0.23487487532682441]
[166,-0.97029572627599647,0.24192189559966773,null,-76,0.10605070022543908,-0.97029572627599647,0.73930066626506041,-0.63730296743998238,null,2.2102154149113089E-2,null,230,0.76604444311897779,-0.64278760968653958,null,null,null,null,166,-0.91605484676251403,0.22839812543811358,null,null,null,null,166,-0.82680407038344617,0.20614540761131722]
[168,-0.97814760073380569,0.20791169081775931,null,-78,9.1141731266711642E-2,-0.97814760073380558,0.73375190213341224,-0.65321335726942475,null,1.899495797379645E-2,null,235,0.81915204428899158,-0.57357643635104649,null,null,null,null,168,-0.9234677905264248,0.19628913836730907,null,null,null,null,168,-0.83349477465643373,0.17716478347090142]
[170,-0.98480775301220802,0.17364817766693028,null,-80,7.6121720147743085E-2,-0.98480775301220802,0.72730917433483044,-0.66832790724283886,null,1.5864619368137694E-2,null,240,0.86602540378443837,-0.50000000000000044,null,null,null,null,170,-0.92975563103688741,0.16394100321742786,null,null,null,null,170,-0.83916999393653013,0.14796831133196917]
[172,-0.99026806874157036,0.13917310096006533,null,-82,6.1008966438426605E-2,-0.99026806874157036,0.71998033234071146,-0.68262820260929968,null,1.2714952167536138E-2,null,245,0.90630778703665005,-0.42261826174069922,null,null,null,null,172,-0.93491070752880745,0.13139313120830184,null,null,null,null,172,-0.8438228138432432,0.11859156259844997]
[174,-0.99452189536827329,0.10452846326765373,null,-84,4.582188270121576E-2,-0.99452189536827329,0.71177430521610363,-0.69609682066169476,null,9.5497937563066761E-3,null,250,0.93969262078590843,-0.3420201433256686,null,null,null,null,174,-0.93892673933555815,9.8685176908359235E-2,null,null,null,null,174,-0.84744756563222823,8.9070328313534744E-2]
[176,-0.9975640502598242,6.9756473744125524E-2,null,-86,3.0578972058253412E-2,-0.9975640502598242,0.70270109074101672,-0.70871735196360885,null,6.373000392418113E-3,null,255,0.96592582628906831,-0.25881904510252068,null,null,null,null,176,-0.94179883354100535,6.5856989921639561E-2,null,null,null,null,176,-0.85003983310178088,5.9440575553801403E-2]
[178,-0.99939082701909576,3.4899496702501143E-2,null,-88,1.5298805648167739E-2,-0.99939082701909576,0.69277174322966717,-0.72047442034169451,null,3.1884425092368633E-3,null,260,0.98480775301220802,-0.17364817766693039,null,null,null,null,178,-0.94352349094077204,3.2948566337191988E-2,null,null,null,null,178,-0.85159645797329753,2.9738403608874503E-2]
[180,-1,1.22514845490862E-16,null,-90,2.6853264191137649E-17,-1,0.68199836006249848,-0.73135370161917046,null,5.5965211290232724E-18,null,265,0.99619469809174555,-8.7155742747658319E-2,null,null,null,null,180,-0.94409861030547937,1.1566609536971335E-16,null,null,null,null,180,-0.85211554373915199,1.0439680418156407E-16]
[182,-0.99939082701909576,-3.48994967025009E-2,null,-92,-1.5298805648167683E-2,-0.99939082701909576,0.67039406694738768,-0.74134194106762508,null,-3.1884425092368516E-3,null,270,1,-2.45029690981724E-16,null,null,null,null,182,-0.94352349094077204,-3.2948566337191759E-2,null,null,null,null,182,-0.85159645797329753,-2.9738403608874295E-2]
[184,-0.9975640502598242,-6.9756473744125275E-2,null,-94,-3.0578972058253454E-2,-0.9975640502598242,0.65797300192799102,-0.75042696955586041,null,-6.3730003924181216E-3,null,275,0.99619469809174555,8.7155742747657833E-2,null,null,null,null,184,-0.94179883354100535,-6.5856989921639325E-2,null,null,null,null,184,-0.85003983310178088,-5.9440575553801188E-2]
[186,-0.99452189536827329,-0.1045284632676535,null,-96,-4.5821882701215802E-2,-0.99452189536827329,0.64475029815871643,-0.75859771837610535,null,-9.5497937563066848E-3,null,280,0.98480775301220813,0.17364817766692991,null,null,null,null,186,-0.93892673933555815,-9.8685176908359012E-2,null,null,null,null,186,-0.84744756563222823,-8.9070328313534536E-2]
[188,-0.99026806874157025,-0.13917310096006552,null,-98,-6.1008966438426557E-2,-0.99026806874157036,0.63074206546730549,-0.76584423272952951,null,-1.2714952167536129E-2,null,285,0.96592582628906842,0.25881904510252024,null,null,null,null,188,-0.93491070752880734,-0.13139313120830204,null,null,null,null,188,-0.84382281384324309,-0.11859156259845013]
[190,-0.98480775301220802,-0.17364817766693047,null,-100,-7.6121720147743044E-2,-0.98480775301220802,0.61596537072748947,-0.77215768385463324,null,-1.5864619368137683E-2,null,290,0.93969262078590832,0.34202014332566893,null,null,null,null,190,-0.92975563103688741,-0.16394100321742802,null,null,null,null,190,-0.83916999393653013,-0.14796831133196933]
[192,{"$f":"COS(RADIANS(A98))","v":-0.97814760073380558},{"$f":"SIN(RADIANS(A98))","v":-0.20791169081775951},null,-102,-9.1141731266711601E-2,{"$f":"SIN(RADIANS(E98))","v":-0.97814760073380569},{"$f":"F98*COS(RADIANS(90-LAT1_))-G98*SIN(RADIANS(90-LAT1_))","v":0.60043821706563372},{"$f":"F98*SIN(RADIANS(90-LAT1_))+G98*COS(RADIANS(90-LAT1_))","v":-0.77753037978373341},null,{"$f":"COS(RADIANS(E98))*COS(RADIANS(AZ_nord1-180))","v":-1.8994957973796439E-2},null,295,0.90630778703664994,0.42261826174069955,null,null,null,null,192,{"$f":"COS(RADIANS(DEC1_))*COS(RADIANS(T98))","v":-0.92346779052642469},-0.19628913836730924,null,null,null,null,192,{"$f":"COS(RADIANS(HC1_))*COS(RADIANS(AA98))","v":-0.83349477465643373},{"$f":"COS(RADIANS(HC1_))*SIN(RADIANS(AA98))","v":-0.17716478347090159}]
[{"$f":"SUM(A98+2)","v":194},-0.97029572627599647,-0.24192189559966751,null,{"$f":"SUM(E98-2)","v":-104},{"$f":"COS(RADIANS(E99))*COS(RADIANS(LHAo1_))","v":-0.10605070022543912},-0.97029572627599647,0.58417952192670064,-0.78195577471444055,null,-2.2102154149113099E-2,null,300,0.8660254037844386,0.5,null,null,null,null,{"$f":"SUM(T98+2)","v":194},-0.91605484676251403,{"$f":"COS(RADIANS(DEC1_))*SIN(RADIANS(T99))","v":-0.22839812543811336},null,null,null,null,{"$f":"SUM(AA98+2)","v":194},-0.82680407038344617,-0.20614540761131703]
[196,-0.96126169593831889,-0.275637355816999,null,-106,-0.12083046274179991,-0.96126169593831889,0.56720909402625685,-0.78542847698471141,null,-2.5182422254174892E-2,null,305,0.8191520442889918,0.57357643635104605,null,null,null,null,196,-0.9075258312752551,-0.2602288445751057,null,null,null,null,196,-0.81910603271009996,-0.23487487532682422]
[198,-0.95105651629515364,-0.30901699437494728,null,-108,-0.13546301195181587,-0.95105651629515364,0.54954760921660517,-0.78794425564175863,null,-2.823200945677478E-2,null,310,0.76604444311897812,0.64278760968653914,null,null,null,null,198,-0.897891135356225,-0.29174251495016384,null,null,null,null,198,-0.81041004050950849,-0.2633181841864467]
[200,-0.93969262078590843,-0.34202014332566866,null,-110,-0.14993052034824592,-0.93969262078590843,0.53121658529644278,-0.78950004559681441,null,-3.1247200304659262E-2,null,315,0.70710678118654768,0.70710678118654735,null,null,null,null,200,-0.88716249739829001,-0.32290074201024466,null,null,null,null,200,-0.80072668850865314,-0.29144068039969484]
[202,-0.92718385456678742,-0.37460659341591201,null,-112,-0.16421536150065782,-0.92718385456678742,0.51223835579473886,-0.79009395135946958,null,-3.4224321252234742E-2,null,320,0.64278760968653958,0.76604444311897779,null,null,null,null,202,-0.87535298859418165,-0.35366556425523227,null,null,null,null,202,-0.79006777438034093,-0.31920810103687131]
[204,-0.91354545764260087,-0.40673664307580021,null,-114,-0.17830013153051846,-0.91354545764260087,0.49263604276076883,-0.7897252493470367,null,-3.7159745136216921E-2,null,325,{"$f":"COS(RADIANS(90+M104))","v":0.57357643635104649},{"$f":"SIN(RADIANS(90+M104))","v":0.81915204428899147},null,null,null,null,204,-0.86247699701126268,-0.38399949948817874,null,null,null,null,204,-0.77844628436955732,-0.3465866157731729]
[206,-0.89879404629916693,-0.43837114678907746,null,-116,-0.19216767031513898,-0.89879404629916693,0.47243352859345988,-0.78839438876612344,null,-4.0049895594770554E-2,null,{"$f":"SUM(M104+5)","v":330},0.49999999999999972,0.86602540378443882,null,null,null,null,206,-0.84855021006188214,-0.41386559048158733,null,null,null,null,206,-0.76587637747172721,-0.37354286810573034]
[208,-0.88294759285892688,-0.46947156278589086,null,-118,-0.2058010823946409,-0.88294759285892688,0.45165542694436622,-0.78610299106534465,null,-4.2891251424755451E-2,null,335,0.42261826174069927,0.90630778703665005,null,null,null,null,208,-0.83358959539068112,-0.44322745000410119,null,null,null,null,208,-0.75237336818215983,-0.40004401599336881]
[210,-0.8660254037844386,-0.50000000000000011,null,-120,-0.21918375755647126,-0.86602540378443871,0.43032705272972616,-0.78285384795983559,null,-4.568035087177004E-2,null,340,0.34202014332566866,0.93969262078590843,null,null,null,null,210,-0.81761338020213015,-0.4720493051527398,null,null,null,null,210,-0.73795370783769554,-0.42605777186957611]
[212,-0.84804809615642607,-0.52991926423320479,null,-122,-0.23229939107238889,-0.84804809615642607,0.40847439128813573,-0.77865091802997854,null,-4.8413795847766047E-2,null,345,0.25881904510252074,0.96592582628906831,null,null,null,null,212,-0.80064102905348944,-0.50029604093667079,null,null,null,null,212,-0.72263496457328569,-0.45155244197992866]
[214,-0.82903757255504185,-0.55919290347074668,null,-124,-0.2451320035632629,-0.82903757255504174,0.38612406672141708,-0.77349932189848125,null,-5.1088256071095108E-2,null,350,0.17364817766693044,0.98480775301220802,null,null,null,null,214,-0.78269322014024301,-0.52793324305941802,null,null,null,null,214,-0.70643580191792621,-0.47649696499605043]
[216,-0.80901699437494756,-0.58778525229247303,null,-126,-0.25766596046748552,-0.80901699437494745,0.36330330945725131,-0.76740533599168714,null,-5.370047312394411E-2,null,355,8.7155742747658374E-2,0.99619469809174555,null,null,null,null,216,-0.76379182010290381,-0.55492723984737935,null,null,null,null,216,-0.68937595605602286,-0.50086094985905527]
[218,-0.78801075360672201,-0.61566147532565818,null,-128,-0.26988599108927713,-0.78801075360672201,0.34003992307309666,-0.76037638489271731,null,-5.6247264422215351E-2,null,null,null,null,null,null,null,null,218,-0.74395985738587977,-0.58124514327357502,null,null,null,null,218,-0.67147621178189087,-0.52461471280637173]
[220,-0.76604444311897801,-0.64278760968653925,null,-130,-0.28177720720367638,-0.76604444311897801,0.31636225042181221,-0.75242103229575885,null,-5.8725527093015005E-2,null,null,null,null,null,null,null,null,220,-0.72322149418086201,-0.60685488902664264,null,null,null,null,220,-0.65275837717668383,-0.54772931353683518]
[222,-0.74314482547739424,-0.66913060635885824,null,-132,-0.29332512119554932,-0.74314482547739424,0.29229913910025768,-0.74354897057252289,null,-6.1132241755025796E-2,null,null,null,null,null,null,null,null,222,-0.7016019969889159,-0.63172527557626079,null,null,null,null,222,-0.63324525703860701,-0.57017659046998692]
[224,-0.71933980033865108,-0.69465837045899737,null,-134,-0.30451566371051669,-0.71933980033865108,0.26787990630294023,-0.73377100896358316,null,-6.346447619715806E-2,null,null,null,null,null,null,null,null,224,-0.67912770583714144,-0.65582600218740827,null,null,null,null,224,-0.61296062509878269,-0.59192919505662178]
[226,-0.69465837045899725,-0.71933980033865119,null,-136,-0.3153352007962949,-0.69465837045899714,0.24313430310352893,-0.72309906040898031,null,-6.5719388950997215E-2,null,null,null,null,null,null,null,null,226,-0.65582600218740816,-0.67912770583714155,null,null,null,null,226,-0.59192919505662167,-0.6129606250987828]
[228,-0.66913060635885813,-0.74314482547739436,null,-138,-0.32577055051356674,-0.66913060635885835,0.21809247820775463,-0.71154612703414089,null,-6.7894232752695377E-2,null,null,null,null,null,null,null,null,228,-0.63172527557626068,-0.70160199698891601,null,null,null,null,228,-0.57017659046998692,-0.63324525703860712]
[230,-0.64278760968653947,-0.7660444431189779,null,-140,-0.33580899899614436,-0.64278760968653947,0.19278494122185477,-0.69912628430878887,null,-6.9986357890089224E-2,null,null,null,null,null,null,null,null,230,-0.60685488902664275,-0.7232214941808619,null,null,null,null,230,-0.5477293135368354,-0.65275837717668372]
[232,-0.61566147532565807,-0.78801075360672213,null,-142,-0.34543831594085606,-0.6156614753256584,0.16724252548131985,-0.68585466389815486,null,-7.1993215430965998E-2,null,null,null,null,null,null,null,null,232,-0.5812451432735749,-0.74395985738587989,null,null,null,null,232,-0.52461471280637162,-0.67147621178189099]
[234,-0.58778525229247325,-0.80901699437494734,null,-144,-0.35464676950828727,-0.58778525229247325,0.14149635048522202,-0.67174743522737312,null,-7.3912360328544841E-2,null,null,null,null,null,null,null,null,234,-0.55492723984737957,-0.76379182010290358,null,null,null,null,234,-0.50086094985905549,-0.68937595605602275]
[236,-0.55919290347074657,-0.82903757255504185,null,-146,-0.36342314061621961,-0.5591929034707469,0.11557778398189988,-0.65682178578152672,null,-7.5741454400389666E-2,null,null,null,null,null,null,null,null,236,-0.52793324305941791,-0.78269322014024301,null,null,null,null,236,-0.47649696499605038,-0.70643580191792621]
[238,-0.52991926423320501,-0.84804809615642596,null,-148,-0.3717567366083544,-0.5299192642332049,8.9518403752188613E-2,-0.64109590016534557,null,-7.7478269177124262E-2,null,null,null,null,null,null,null,null,238,-0.50029604093667102,-0.80064102905348933,null,null,null,null,238,-0.45155244197992883,-0.72263496457328558]
[240,-0.50000000000000044,-0.86602540378443837,null,-150,-0.37963740428166726,-0.49999999999999994,6.3349959136758338E-2,-0.62458893794806603,null,-7.9120688617479007E-2,null,null,null,null,null,null,null,null,240,-0.47204930515274013,-0.81761338020212992,null,null,null,null,240,-0.42605777186957638,-0.73795370783769532]
[242,-0.46947156278589075,-0.88294759285892699,null,-152,-0.38705554225652211,-0.46947156278589069,3.7104332354433056E-2,-0.60732101032044716,null,-8.0666711686361123E-2,null,null,null,null,null,null,null,null,242,-0.44322745000410108,-0.83358959539068112,null,null,null,null,242,-0.40004401599336875,-0.75237336818215994]
[244,-0.43837114678907774,-0.89879404629916682,null,-154,-0.39400211267447305,-0.43837114678907729,1.0813499658618164E-2,-0.58931315559238273,null,-8.2114454792807795E-2,null,null,null,null,null,null,null,null,244,-0.41386559048158761,-0.84855021006188203,null,null,null,null,244,-0.37354286810573056,-0.7658763774717271]
[246,-0.4067366430758001,-0.91354545764260098,null,-156,-0.40046865220950301,-0.40673664307580043,-1.5490507620838534E-2,-0.57058731356096204,null,-8.3462154084851511E-2,null,null,null,null,null,null,null,null,246,-0.38399949948817863,-0.86247699701126279,null,null,null,null,246,-0.34658661577317279,-0.77844628436955743]
[248,-0.37460659341591229,-0.92718385456678731,null,-158,-0.40644728237928263,-0.37460659341591224,-4.177564210288931E-2,-0.55116629878020507,null,-8.4708167598502138E-2,null,null,null,null,null,null,null,null,248,-0.35366556425523255,-0.87535298859418165,null,null,null,null,248,-0.31920810103687153,-0.79006777438034081]
[250,-0.34202014332566855,-0.93969262078590843,null,-160,-0.41193071914388746,-0.34202014332566888,-6.8009879400082129E-2,-0.53107377276504408,null,-8.5850977258226921E-2,null,null,null,null,null,null,null,null,250,-0.32290074201024455,-0.88716249739829001,null,null,null,null,250,-0.29144068039969473,-0.80072668850865314]
[252,-0.30901699437494756,-0.95105651629515353,null,-162,-0.41691228178027839,-0.30901699437494751,-9.4161257135344734E-2,-0.51033421516341237,null,-8.688919072649183E-2,null,null,null,null,null,null,null,null,252,-0.29174251495016412,-0.89789113535622489,null,null,null,null,252,-0.26331818418644692,-0.81041004050950838]
[254,-0.27563735581699889,-0.96126169593831901,null,-164,-0.42138590102173401,-0.27563735581699922,-0.12019791388321768,-0.48897289393156362,null,-8.7821543100110311E-2,null,null,null,null,null,null,null,null,254,-0.26022884457510559,-0.90752583127525521,null,null,null,null,254,-0.23487487532682411,-0.81910603271010007]
[256,{"$f":"COS(RADIANS(A130))","v":-0.24192189559966779},{"$f":"SIN(RADIANS(A130))","v":-0.97029572627599647},null,-166,-0.42534612645231662,{"$f":"SIN(RADIANS(E130))","v":-0.24192189559966773},{"$f":"F130*COS(RADIANS(90-LAT1_))-G130*SIN(RADIANS(90-LAT1_))","v":-0.14608812798809315},{"$f":"F130*SIN(RADIANS(90-LAT1_))+G130*COS(RADIANS(90-LAT1_))","v":-0.46701583454895956},null,{"$f":"COS(RADIANS(E130))*COS(RADIANS(AZ_nord1-180))","v":-8.8646898451332959E-2},null,null,null,null,null,null,null,null,256,{"$f":"COS(RADIANS(DEC1_))*COS(RADIANS(T130))","v":-0.22839812543811361},-0.91605484676251403,null,null,null,null,256,{"$f":"COS(RADIANS(HC1_))*COS(RADIANS(AA130))","v":-0.20614540761131728},{"$f":"COS(RADIANS(HC1_))*SIN(RADIANS(AA130))","v":-0.82680407038344617}]
[{"$f":"SUM(A130+2)","v":258},-0.20791169081775979,-0.97814760073380558,null,{"$f":"SUM(E130-2)","v":-168},{"$f":"COS(RADIANS(E131))*COS(RADIANS(LHAo1_))","v":-0.42878813314736525},-0.20791169081775931,-0.17180035621216622,-0.44448978831023211,null,-8.9364251211800583E-2,null,null,null,null,null,null,null,null,258,-0.19628913836730952,{"$f":"COS(RADIANS(DEC1_))*SIN(RADIANS(T131))","v":-0.92346779052642469},null,null,null,null,258,-0.17716478347090184,-0.83349477465643373]
[260,-0.17364817766693033,-0.98480775301220802,null,-170,-0.43170772755192227,-0.17364817766693028,-0.19730327216601085,-0.42142219973285172,null,-8.9972727397674257E-2,null,null,null,null,null,null,null,null,260,-0.16394100321742791,-0.92975563103688741,null,null,null,null,260,-0.14796831133196922,-0.83916999393653013]
[262,-0.13917310096006583,-0.99026806874157025,null,-172,-0.43410135258993499,-0.13917310096006533,-0.22256580447496055,-0.39784117312021039,null,-9.04715856744501E-2,null,null,null,null,null,null,null,null,262,-0.13139313120830232,-0.93491070752880734,null,null,null,null,262,-0.11859156259845038,-0.84382281384324309]
[264,-0.10452846326765336,-0.9945218953682734,null,-174,-0.43596609199800401,-0.10452846326765373,-0.2475571746347911,-0.37377543832085713,null,-9.0860218260161038E-2,null,null,null,null,null,null,null,null,264,-9.8685176908358888E-2,-0.93892673933555826,null,null,null,null,264,-8.9070328313534425E-2,-0.84744756563222834]
[266,-6.975647374412558E-2,-0.9975640502598242,null,-176,-0.43729967387840185,-6.9756473744125524E-2,-0.27224693451058896,-0.34925431572560217,null,-9.1138151665865669E-2,null,null,null,null,null,null,null,null,266,-6.5856989921639617E-2,-0.94179883354100535,null,null,null,null,266,-5.9440575553801452E-2,-0.85003983310178088]
[268,-3.4899496702500761E-2,-0.99939082701909576,null,-178,-0.43810047346702979,-3.4899496702501143E-2,-0.29660500343311108,-0.3243076805451387,null,-9.1305047272521506E-2,null,null,null,null,null,null,null,null,268,-3.2948566337191627E-2,-0.94352349094077204,null,null,null,null,268,-2.9738403608874177E-2,-0.85159645797329753]
[270,-1.83772268236293E-16,-1,null,-180,-0.43836751511294275,-1.22514845490862E-16,-0.32060170484744821,-0.29896592641169961,null,-9.1360701743540121E-2,null,null,null,null,null,null,null,null,270,-1.7349914305457002E-16,-0.94409861030547937,null,null,null,null,270,-1.5659520627234611E-16,-0.85211554373915199]
[272,3.4899496702501281E-2,-0.99939082701909576,null,-182,-0.43810047346702979,3.48994967025009E-2,-0.34420780246933558,-0.2732599283490984,null,-9.1305047272521506E-2,null,null,null,null,null,null,null,null,272,3.294856633719212E-2,-0.94352349094077204,null,null,null,null,272,2.9738403608874621E-2,-0.85159645797329753]
[274,6.9756473744125219E-2,-0.99756405025982431,null,-184,-0.43729967387840185,6.9756473744125275E-2,-0.36739453590506144,-0.24722100515626899,null,-9.1138151665865669E-2,null,null,null,null,null,null,null,null,274,6.5856989921639283E-2,-0.94179883354100546,null,null,null,null,274,5.9440575553801139E-2,-0.85003983310178088]
[276,0.10452846326765299,-0.9945218953682734,null,-186,-0.43596609199800401,0.1045284632676535,-0.39013365569157682,-0.22088088125013322,null,-9.0860218260161038E-2,null,null,null,null,null,null,null,null,276,9.8685176908358527E-2,-0.93892673933555826,null,null,null,null,276,8.9070328313534106E-2,-0.84744756563222834]
[278,0.13917310096006547,-0.99026806874157036,null,-188,-0.43410135258993493,0.13917310096006552,-0.41239745771411479,-0.19427164801428565,null,-9.0471585674450086E-2,null,null,null,null,null,null,null,null,278,0.13139313120830198,-0.93491070752880745,null,null,null,null,278,0.11859156259845008,-0.8438228138432432]
[280,0.17364817766692997,-0.98480775301220813,null,-190,-0.43170772755192227,0.17364817766693047,-0.43415881695938663,-0.16742572470058595,null,-8.9972727397674257E-2,null,null,null,null,null,null,null,null,280,0.16394100321742755,-0.92975563103688741,null,null,null,null,280,0.14796831133196889,-0.83916999393653025]
[282,0.20791169081775943,-0.97814760073380558,null,-192,-0.42878813314736519,0.20791169081775951,-0.45539122056323245,-0.14037581893129439,null,-8.9364251211800583E-2,null,null,null,null,null,null,null,null,282,0.19628913836730916,-0.92346779052642469,null,null,null,null,282,0.17716478347090153,-0.83349477465643373]
[284,0.24192189559966745,-0.97029572627599658,null,-194,-0.42534612645231662,0.24192189559966751,-0.47606880011246172,-0.11315488684987271,null,-8.8646898451332959E-2,null,null,null,null,null,null,null,null,284,0.2283981254381133,-0.91605484676251414,null,null,null,null,284,0.206145407611317,-0.82680407038344617]
[286,0.27563735581699939,-0.96126169593831878,null,-196,-0.42138590102173401,0.275637355816999,-0.49616636316153118,-8.5796092968998289E-2,null,-8.7821543100110311E-2,null,null,null,null,null,null,null,null,286,0.26022884457510603,-0.90752583127525499,null,null,null,null,286,0.23487487532682455,-0.81910603271009985]
[288,0.30901699437494723,-0.95105651629515364,null,-198,-0.41691228178027845,0.30901699437494728,-0.51565942392565756,-5.8332769764716075E-2,null,-8.688919072649183E-2,null,null,null,null,null,null,null,null,288,0.29174251495016379,-0.897891135356225,null,null,null,null,288,0.26331818418644665,-0.81041004050950849]
[290,0.34202014332566899,-0.93969262078590832,null,-200,-0.41193071914388751,0.34202014332566866,-0.5345242331129757,-3.0798377065949956E-2,null,-8.5850977258226935E-2,null,null,null,null,null,null,null,null,290,0.32290074201024499,-0.8871624973982899,null,null,null,null,290,0.29144068039969512,-0.80072668850865303]
[292,0.37460659341591196,-0.92718385456678742,null,-202,-0.40644728237928268,0.37460659341591201,-0.55273780685939178,-3.2264612888551758E-3,null,-8.4708167598502151E-2,null,null,null,null,null,null,null,null,292,0.35366556425523221,-0.87535298859418165,null,null,null,null,292,0.31920810103687125,-0.79006777438034093]
[294,0.40673664307579976,-0.91354545764260109,null,-204,-0.40046865220950306,0.40673664307580021,-0.57027795473088183,2.4349385434321691E-2,null,-8.3462154084851525E-2,null,null,null,null,null,null,null,null,294,0.38399949948817835,-0.8624769970112629,null,null,null,null,294,0.34658661577317251,-0.77844628436955743]
[296,0.4383711467890774,-0.89879404629916704,null,-206,-0.39400211267447305,0.43837114678907746,-0.58712330675911706,5.1895566182082187E-2,null,-8.2114454792807781E-2,null,null,null,null,null,null,null,null,296,0.41386559048158728,-0.84855021006188225,null,null,null,null,296,0.37354286810573029,-0.76587637747172732]
[298,0.46947156278589042,-0.8829475928589271,null,-208,-0.38705554225652206,0.46947156278589086,-0.6032533394774785,7.9378520176348943E-2,null,-8.0666711686361109E-2,null,null,null,null,null,null,null,null,298,0.44322745000410074,-0.83358959539068123,null,null,null,null,298,0.40004401599336847,-0.75237336818216005]
[300,0.50000000000000011,-0.8660254037844386,null,-210,-0.37963740428166726,0.50000000000000011,-0.61864840092574014,0.10676476367110449,null,-7.9120688617478993E-2,null,null,null,null,null,null,null,null,300,0.4720493051527398,-0.81761338020213015,null,null,null,null,300,0.42605777186957611,-0.73795370783769554]
[302,0.52991926423320468,-0.84804809615642618,null,-212,-0.37175673660835445,0.52991926423320479,-0.63328973459295446,0.13402093074717769,null,-7.7478269177124276E-2,null,null,null,null,null,null,null,null,302,0.50029604093667068,-0.80064102905348955,null,null,null,null,302,0.45155244197992855,-0.7226349645732858]
[304,0.55919290347074702,-0.82903757255504162,null,-214,-0.36342314061621966,0.55919290347074668,-0.6471595022693728,0.16111381396347743,null,-7.5741454400389679E-2,null,null,null,null,null,null,null,null,304,0.52793324305941836,-0.78269322014024278,null,null,null,null,304,0.47649696499605071,-0.70643580191792599]
[306,0.58778525229247292,-0.80901699437494756,null,-216,-0.35464676950828733,0.58778525229247303,-0.66024080577955524,0.18801040481514331,null,-7.3912360328544854E-2,null,null,null,null,null,null,null,null,306,0.55492723984737924,-0.76379182010290381,null,null,null,null,306,0.50086094985905516,-0.68937595605602286]
[308,0.61566147532565851,-0.78801075360672179,null,-218,-0.34543831594085611,0.61566147532565818,-0.67251770757019491,0.21467793394932461,null,-7.1993215430966012E-2,null,null,null,null,null,null,null,null,308,0.58124514327357535,-0.74395985738587955,null,null,null,null,308,0.52461471280637206,-0.67147621178189065]
[310,0.64278760968653925,-0.76604444311897812,null,-220,-0.33580899899614441,0.64278760968653925,-0.68397525012757165,0.24108391108958932,null,-6.9986357890089237E-2,null,null,null,null,null,null,null,null,310,0.60685488902664264,-0.72322149418086212,null,null,null,null,310,0.54772931353683518,-0.65275837717668395]
[312,0.66913060635885779,-0.74314482547739458,null,-222,-0.32577055051356685,0.66913060635885824,-0.69459947420097856,0.26719616462032114,null,-6.7894232752695391E-2,null,null,null,null,null,null,null,null,312,0.63172527557626035,-0.70160199698891623,null,null,null,null,312,0.57017659046998659,-0.63324525703860735]
[314,0.69465837045899725,-0.71933980033865119,null,-224,-0.31533520079629485,0.69465837045899737,-0.70437743580991841,0.29298288078287704,null,-6.5719388950997201E-2,null,null,null,null,null,null,null,null,314,0.65582600218740816,-0.67912770583714155,null,null,null,null,314,0.59192919505662167,-0.6129606250987828]
[316,0.71933980033865086,-0.69465837045899759,null,-226,-0.30451566371051664,0.71933980033865119,-0.71329722201435009,0.31841264243575185,null,-6.3464476197158046E-2,null,null,null,null,null,null,null,null,316,0.67912770583714133,-0.6558260021874085,null,null,null,null,316,0.61296062509878246,-0.591929195056622]
[318,0.74314482547739424,-0.66913060635885813,null,-228,-0.29332512119554927,0.74314482547739436,-0.72134796542877133,0.34345446733152662,null,-6.1132241755025789E-2,null,null,null,null,null,null,null,null,318,0.7016019969889159,-0.63172527557626068,null,null,null,null,318,0.63324525703860701,-0.57017659046998692]
[320,{"$f":"COS(RADIANS(A162))","v":0.76604444311897779},{"$f":"SIN(RADIANS(A162))","v":-0.64278760968653958},null,-230,-0.28177720720367644,{"$f":"SIN(RADIANS(E162))","v":0.7660444431189779},{"$f":"F162*COS(RADIANS(90-LAT1_))-G162*SIN(RADIANS(90-LAT1_))","v":-0.72851985746245351},{"$f":"F162*SIN(RADIANS(90-LAT1_))+G162*COS(RADIANS(90-LAT1_))","v":0.36807784586396242},null,{"$f":"COS(RADIANS(E162))*COS(RADIANS(AZ_nord1-180))","v":-5.8725527093015012E-2},null,null,null,null,null,null,null,null,320,{"$f":"COS(RADIANS(DEC1_))*COS(RADIANS(T162))","v":0.72322149418086179},-0.60685488902664286,null,null,null,null,320,{"$f":"COS(RADIANS(HC1_))*COS(RADIANS(AA162))","v":0.65275837717668361},{"$f":"COS(RADIANS(HC1_))*SIN(RADIANS(AA162))","v":-0.54772931353683552}]
[{"$f":"SUM(A162+2)","v":322},0.78801075360672201,-0.61566147532565818,null,{"$f":"SUM(E162-2)","v":-232},{"$f":"COS(RADIANS(E163))*COS(RADIANS(LHAo1_))","v":-0.26988599108927702},0.78801075360672213,-0.7348041602696993,0.39225277823925936,null,-5.624726442221533E-2,null,null,null,null,null,null,null,null,{"$f":"SUM(T162+2)","v":322},0.74395985738587977,{"$f":"COS(RADIANS(DEC1_))*SIN(RADIANS(T163))","v":-0.58124514327357502},null,null,null,null,{"$f":"SUM(AA162+2)","v":322},0.67147621178189087,-0.52461471280637173]
[324,0.80901699437494734,-0.58778525229247336,null,-234,-0.25766596046748563,0.80901699437494734,-0.7401932173955601,0.41594981102617956,null,-5.3700473123944131E-2,null,null,null,null,null,null,null,null,324,0.76379182010290358,-0.55492723984737968,null,null,null,null,324,0.68937595605602275,-0.5008609498590556]
[326,0.82903757255504185,-0.55919290347074657,null,-236,-0.24513200356326284,0.82903757255504185,-0.74468046310404912,0.43914007304052161,null,-5.1088256071095101E-2,null,null,null,null,null,null,null,null,326,0.78269322014024301,-0.52793324305941791,null,null,null,null,326,0.70643580191792621,-0.47649696499605038]
[328,0.84804809615642596,-0.52991926423320501,null,-238,-0.23229939107238901,0.84804809615642596,-0.74826043037747747,0.46179531052020606,null,-4.8413795847766068E-2,null,null,null,null,null,null,null,null,328,0.80064102905348933,-0.50029604093667102,null,null,null,null,328,0.72263496457328558,-0.45155244197992883]
[330,0.86602540378443837,-0.50000000000000044,null,-240,-0.21918375755647157,0.86602540378443837,-0.75092875757717426,0.48388792154813587,null,-4.5680350871770102E-2,null,null,null,null,null,null,null,null,330,0.81761338020212992,-0.47204930515274013,null,null,null,null,330,0.73795370783769532,-0.42605777186957638]
[332,0.88294759285892688,-0.46947156278589081,null,-242,-0.20580108239464082,0.88294759285892699,-0.75268219375747125,0.50539098968088025,null,-4.2891251424755437E-2,null,null,null,null,null,null,null,null,332,0.83358959539068112,-0.44322745000410113,null,null,null,null,332,0.75237336818215983,-0.40004401599336875]
[334,0.89879404629916682,-0.43837114678907779,null,-244,-0.19216767031513907,0.89879404629916682,-0.75351860262647841,0.52627831674221204,null,-4.0049895594770575E-2,null,null,null,null,null,null,null,null,334,0.84855021006188203,-0.41386559048158766,null,null,null,null,334,0.7658763774717271,-0.37354286810573062]
[336,0.91354545764260098,-0.40673664307580015,null,-246,-0.17830013153051841,0.91354545764260098,-0.75343696514882808,0.54652445474155398,null,-3.7159745136216907E-2,null,null,null,null,null,null,null,null,336,0.86247699701126279,-0.38399949948817869,null,null,null,null,336,0.77844628436955743,-0.34658661577317285]
[338,0.92718385456678731,-0.37460659341591235,null,-248,-0.16421536150065794,0.92718385456678731,-0.75243738078721145,0.56610473687843144,null,-3.4224321252234763E-2,null,null,null,null,null,null,null,null,338,0.87535298859418165,-0.3536655642552326,null,null,null,null,338,0.79006777438034081,-0.31920810103687158]
[340,0.93969262078590843,-0.3420201433256686,null,-250,-0.14993052034824586,0.93969262078590843,-0.75052106738119884,0.58499530759517293,null,-3.1247200304659248E-2,null,null,null,null,null,null,null,null,340,0.88716249739829001,-0.3229007420102446,null,null,null,null,340,0.80072668850865314,-0.29144068039969478]
[342,0.95105651629515353,-0.30901699437494762,null,-252,-0.13546301195181598,0.95105651629515353,-0.74769035966349018,0.60317315164122831,null,-2.8232009456774801E-2,null,null,null,null,null,null,null,null,342,0.89789113535622489,-0.29174251495016418,null,null,null,null,342,0.81041004050950838,-0.26331818418644698]
[344,0.96126169593831889,-0.27563735581699894,null,-254,-0.12083046274179984,0.96126169593831901,-0.74394870641540223,0.62061612211371087,null,-2.5182422254174879E-2,null,null,null,null,null,null,null,null,344,0.9075258312752551,-0.26022884457510564,null,null,null,null,344,0.81910603271009996,-0.23487487532682416]
[346,0.97029572627599647,-0.24192189559966787,null,-256,-0.10605070022543912,0.97029572627599647,-0.73930066626506041,0.63730296743998238,null,-2.2102154149113099E-2,null,null,null,null,null,null,null,null,346,0.91605484676251403,-0.22839812543811369,null,null,null,null,346,0.82680407038344617,-0.20614540761131736]
[348,0.97814760073380558,-0.20791169081775987,null,-258,-9.1141731266711795E-2,0.97814760073380558,-0.73375190213341235,0.65321335726942464,null,-1.8994957973796481E-2,null,null,null,null,null,null,null,null,348,0.92346779052642469,-0.1962891383673096,null,null,null,null,348,0.83349477465643373,-0.17716478347090189]
[350,0.98480775301220802,-0.17364817766693039,null,-260,-7.6121720147743044E-2,0.98480775301220802,-0.72730917433483033,0.66832790724283886,null,-1.5864619368137687E-2,null,null,null,null,null,null,null,null,350,0.92975563103688741,-0.16394100321742797,null,null,null,null,350,0.83916999393653013,-0.14796831133196925]
[352,0.99026806874157025,-0.13917310096006588,null,-262,-6.1008966438426765E-2,0.99026806874157025,-0.71998033234071168,0.68262820260929957,null,-1.2714952167536171E-2,null,null,null,null,null,null,null,null,352,0.93491070752880734,-0.13139313120830237,null,null,null,null,352,0.84382281384324309,-0.11859156259845044]
[354,0.99452189536827329,-0.10452846326765342,null,-264,-4.5821882701215719E-2,0.9945218953682734,-0.71177430521610374,0.69609682066169476,null,-9.5497937563066675E-3,null,null,null,null,null,null,null,null,354,0.93892673933555815,-9.8685176908358943E-2,null,null,null,null,354,0.84744756563222823,-8.9070328313534466E-2]
[356,0.9975640502598242,-6.9756473744125636E-2,null,-266,-3.0578972058253565E-2,0.9975640502598242,-0.70270109074101683,0.70871735196360874,null,-6.3730003924181442E-3,null,null,null,null,null,null,null,null,356,0.94179883354100535,-6.5856989921639672E-2,null,null,null,null,356,0.85003983310178088,-5.9440575553801493E-2]
[358,0.99939082701909576,-3.4899496702500823E-2,null,-268,-1.5298805648167598E-2,0.99939082701909576,-0.69277174322966706,0.72047442034169462,null,-3.1884425092368338E-3,null,null,null,null,null,null,null,null,358,0.94352349094077204,-3.294856633719169E-2,null,null,null,null,358,0.85159645797329753,-2.9738403608874232E-2]
[360,1,-2.45029690981724E-16,null,-270,-8.0559792573412946E-17,1,-0.68199836006249859,0.73135370161917046,null,-1.6789563387069816E-17,null,null,null,null,null,null,null,null,360,0.94409861030547937,-2.3133219073942669E-16,null,null,null,null,360,0.85211554373915199,-2.0879360836312814E-16]

{"sheet":"CALC2","index":6,"n_rows":182,"n_cols":48,"rows_kept":182,"cut":false,"hidden":true,"merged":[]}
["Plot of local meridian circle",null,null,null,"Plot of LHA meridian",null,null,null,null,null,"Plot of North AZIMUT",null,null,"Plot of the EQUATOR",null,null,"South Pole view",null,null,"Declination circle",null,null,null,"Zenith view",null,null,"Altitude circle",null,null,null,"Plot of circle of position (COP2) for body 2",null,null,null,null,null,"slope and offset for linear approx. at Lat or Lon near intersection (n=0: x=my+b; n=1: y=mx+b)"]
[0,{"$f":"COS(RADIANS(A2))","v":1},{"$f":"SIN(RADIANS(A2))","v":0},null,90,{"$f":"COS(RADIANS(E2))*COS(RADIANS(Sight2!LHA2_))","v":5.5517999339035083E-17},{"$f":"SIN(RADIANS(E2))","v":1},{"$f":"F2*COS(RADIANS(90-Sight2!LAT2_))-G2*SIN(RADIANS(90-Sight2!LAT2_))","v":-0.68199836006249848},{"$f":"F2*SIN(RADIANS(90-Sight2!LAT2_))+G2*COS(RADIANS(90-Sight2!LAT2_))","v":0.73135370161917046},null,{"$f":"COS(RADIANS(E2))*COS(RADIANS(Sight2!AZ_nord2-180))","v":5.5727505881307343E-17},null,null,{"$f":"1.1*COS(RADIANS(90-Sight2!LAT2_))","v":0.80448907178108753},{"$f":"1.1*SIN(RADIANS(90-Sight2!LAT2_))","v":0.75019819606874838},null,0,0,null,0,{"$f":"COS(RADIANS(Sight2!DEC2_))*COS(RADIANS(T2))","v":0.93296400631343779},{"$f":"COS(RADIANS(Sight2!DEC2_))*SIN(RADIANS(T2))","v":0},null,0,0,null,0,{"$f":"COS(RADIANS(Sight2!HC2_))*COS(RADIANS(AA2))","v":0.94962138423973086},{"$f":"COS(RADIANS(Sight2!HC2_))*SIN(RADIANS(AA2))","v":0},null,"Azimut from body to PLOP1 (great circle)",null,null,null,null,null,"m","b","n"]
[{"$f":"SUM(A2+2)","v":2},0.99939082701909576,3.4899496702500969E-2,null,{"$f":"SUM(E2-2)","v":88},{"$f":"COS(RADIANS(E3))*COS(RADIANS(Sight2!LHA2_))","v":3.1629640099519657E-2},{"$f":"SIN(RADIANS(E3))","v":0.99939082701909576},{"$f":"F3*COS(RADIANS(90-Sight2!LAT2_))-G3*SIN(RADIANS(90-Sight2!LAT2_))","v":-0.6584504507208615},{"$f":"F3*SIN(RADIANS(90-Sight2!LAT2_))+G3*COS(RADIANS(90-Sight2!LAT2_))","v":0.75247954338189926},null,{"$f":"COS(RADIANS(E3))*COS(RADIANS(Sight2!AZ_nord2-180))","v":3.1748999885705384E-2},null,null,{"$f":"1.1*COS(RADIANS(270-Sight2!LAT2_))","v":-0.80448907178108764},{"$f":"1.1*SIN(RADIANS(270-Sight2!LAT2_))","v":-0.75019819606874827},null,null,null,null,{"$f":"SUM(T2+2)","v":2},{"$f":"COS(RADIANS(Sight2!DEC2_))*COS(RADIANS(T3))","v":0.93239566984863542},{"$f":"COS(RADIANS(Sight2!DEC2_))*SIN(RADIANS(T3))","v":3.2559974261887913E-2},null,null,null,null,{"$f":"SUM(AA2+2)","v":2},{"$f":"COS(RADIANS(Sight2!HC2_))*COS(RADIANS(AA3))","v":0.94904290055036311},{"$f":"COS(RADIANS(Sight2!HC2_))*SIN(RADIANS(AA3))","v":3.3141308367898893E-2},null,"acos","AZ(deg)",null,null,null,"LOP2:",0.31524666485666425,24.360802998386188,1]
[4,0.9975640502598242,6.9756473744125302E-2,null,86,{"$f":"COS(RADIANS(E4))*COS(RADIANS(Sight2!LHA2_))","v":6.3220744354750349E-2},0.9975640502598242,{"$f":"F4*COS(RADIANS(90-Sight2!LAT2_))-G4*SIN(RADIANS(90-Sight2!LAT2_))","v":-0.6341003209315379},{"$f":"F4*SIN(RADIANS(90-Sight2!LAT2_))+G4*COS(RADIANS(90-Sight2!LAT2_))","v":0.77268860473160483},null,{"$f":"COS(RADIANS(E4))*COS(RADIANS(Sight2!AZ_nord2-180))","v":6.3459318505608292E-2},null,null,null,null,null,"Zénith",null,null,4,{"$f":"COS(RADIANS(Sight2!DEC2_))*COS(RADIANS(T4))","v":0.9306913528846652},{"$f":"COS(RADIANS(Sight2!DEC2_))*SIN(RADIANS(T4))","v":6.5080279210617278E-2},null,"North Pole",null,null,4,{"$f":"COS(RADIANS(Sight2!HC2_))*COS(RADIANS(AA4))","v":0.94730815427552673},{"$f":"COS(RADIANS(Sight2!HC2_))*SIN(RADIANS(AA4))","v":6.6242239156578717E-2},null,{"$f":"ACOS(IF(AG4>0,IF((ABS(1-AG4))<0.000000000001,1,AG4),IF((ABS(1+AG4))<0.000000000001,-1,AG4)))","v":0.3083821604378234},{"$f":"DEGREES(AE4)","v":17.668996270213508},{"$f":"(SIN(RADIANS(LatLP2))-(SIN(RADIANS(LatB2))*SIN(RADIANS(Sight2!HO2_))))/(COS(RADIANS(LatB2))*COS(RADIANS(Sight2!HO2_)))","v":0.95282585928025809}]
[6,0.99452189536827329,0.10452846326765347,null,84,{"$f":"COS(RADIANS(E5))*COS(RADIANS(Sight2!LHA2_))","v":9.4734823871394105E-2},0.99452189536827329,{"$f":"F5*COS(RADIANS(90-Sight2!LAT2_))-G5*SIN(RADIANS(90-Sight2!LAT2_))","v":-0.60897763757682588},{"$f":"F5*SIN(RADIANS(90-Sight2!LAT2_))+G5*COS(RADIANS(90-Sight2!LAT2_))","v":0.79195626404000041},null,{"$f":"COS(RADIANS(E5))*COS(RADIANS(Sight2!AZ_nord2-180))","v":9.5092321721070988E-2},null,null,"Plot of POLES",null,null,0,{"$f":"COS(RADIANS(Sight2!LAT2_))","v":0.68199836006249848},null,6,{"$f":"COS(RADIANS(Sight2!DEC2_))*COS(RADIANS(T5))","v":0.92785313186921781},{"$f":"COS(RADIANS(Sight2!DEC2_))*SIN(RADIANS(T5))","v":9.7521293863976996E-2},null,0,{"$f":"COS(RADIANS(Sight2!LAT2_))","v":0.68199836006249848},null,6,{"$f":"COS(RADIANS(Sight2!HC2_))*COS(RADIANS(AA5))","v":0.94441925893634049},{"$f":"COS(RADIANS(Sight2!HC2_))*SIN(RADIANS(AA5))","v":9.9262463980680948E-2},null,"Azimut North from body to PLOP2 (rad-deg)"]
[8,0.99026806874157036,0.13917310096006544,null,82,{"$f":"COS(RADIANS(E6))*COS(RADIANS(Sight2!LHA2_))","v":0.1261334835979315},0.99026806874157036,{"$f":"F6*COS(RADIANS(90-Sight2!LAT2_))-G6*SIN(RADIANS(90-Sight2!LAT2_))","v":-0.58311300877654038},{"$f":"F6*SIN(RADIANS(90-Sight2!LAT2_))+G6*COS(RADIANS(90-Sight2!LAT2_))","v":0.81025904663217396},null,{"$f":"COS(RADIANS(E6))*COS(RADIANS(Sight2!AZ_nord2-180))","v":0.12660946959036579},null,null,{"$f":"1.1*COS(RADIANS(180-Sight2!LAT2_))","v":-0.75019819606874827},{"$f":"1.1*SIN(RADIANS(180-Sight2!LAT2_))","v":0.80448907178108764},null,null,null,null,8,{"$f":"COS(RADIANS(Sight2!DEC2_))*COS(RADIANS(T6))","v":0.92388446473740626},{"$f":"COS(RADIANS(Sight2!DEC2_))*SIN(RADIANS(T6))","v":0.12984349384276719},null,null,null,null,8,{"$f":"COS(RADIANS(Sight2!HC2_))*COS(RADIANS(AA6))","v":0.94037973420677501},{"$f":"COS(RADIANS(Sight2!HC2_))*SIN(RADIANS(AA6))","v":0.13216175278263315},null,{"$f":"IF(AND(LatB2=0,LatLP2=0),IF((LonLP2-LonB2)>0,3*PI()/2,PI()/2),IF(LonLP2=LonB2,IF((LatLP2-LatB2)>0,0,PI()),IF((LonLP2-LonB2)<0,AE4,2*PI()-AE4)))","v":0.3083821604378234},{"$f":"IF(DEGREES(ZB2Nr)>=360,DEGREES(ZB2Nr)-360,IF(LonLP2-LonB2>180,DEGREES(2*PI()-ZB2Nr),IF(LonLP2-LonB2<-180,DEGREES(2*PI()-ZB2Nr),DEGREES(ZB2Nr))))","v":17.668996270213508}]
[10,0.98480775301220802,0.17364817766693033,null,80,{"$f":"COS(RADIANS(E7))*COS(RADIANS(Sight2!LHA2_))","v":0.15737846910407852},0.98480775301220802,{"$f":"F7*COS(RADIANS(90-Sight2!LAT2_))-G7*SIN(RADIANS(90-Sight2!LAT2_))","v":-0.55653794659673383},{"$f":"F7*SIN(RADIANS(90-Sight2!LAT2_))+G7*COS(RADIANS(90-Sight2!LAT2_))","v":0.8275746533868642},null,{"$f":"COS(RADIANS(E7))*COS(RADIANS(Sight2!AZ_nord2-180))","v":0.15797236332365847},null,null,{"$f":"1.1*COS(RADIANS(-Sight2!LAT2_))","v":0.75019819606874838},{"$f":"1.1*SIN(RADIANS(-Sight2!LAT2_))","v":-0.80448907178108753},null,"Zénith line + label",null,"nadir",10,{"$f":"COS(RADIANS(Sight2!DEC2_))*COS(RADIANS(T7))","v":0.91879018669880408},{"$f":"COS(RADIANS(Sight2!DEC2_))*SIN(RADIANS(T7))","v":0.16200749952516696},null,"Z meridian",null,null,10,{"$f":"COS(RADIANS(Sight2!HC2_))*COS(RADIANS(AA7))","v":0.93519450162547191},{"$f":"COS(RADIANS(Sight2!HC2_))*SIN(RADIANS(AA7))","v":0.1649000228467771},null,"D","acosLatv","LatV","cs/sndLov","ifdLov","dLoV","DV","DVx","asindLovx","dLoVx","AzNB-LOP","Latx","DRLatx","GHAx","GHAxcor","DRLonx","linLat2","linLon2"]
[12,0.97814760073380569,0.20791169081775934,null,78,{"$f":"COS(RADIANS(E8))*COS(RADIANS(Sight2!LHA2_))","v":0.18843171318791696},0.97814760073380558,{"$f":"F8*COS(RADIANS(90-Sight2!LAT2_))-G8*SIN(RADIANS(90-Sight2!LAT2_))","v":-0.52928482865709803},{"$f":"F8*SIN(RADIANS(90-Sight2!LAT2_))+G8*COS(RADIANS(90-Sight2!LAT2_))","v":0.84388198790450553},null,{"$f":"COS(RADIANS(E8))*COS(RADIANS(Sight2!AZ_nord2-180))","v":0.18914279206601842},null,null,null,null,null,0,0,null,12,{"$f":"COS(RADIANS(Sight2!DEC2_))*COS(RADIANS(T8))","v":0.91257650434648829},{"$f":"COS(RADIANS(Sight2!DEC2_))*SIN(RADIANS(T8))","v":0.19397412402473754},null,0,-1,null,12,{"$f":"COS(RADIANS(Sight2!HC2_))*COS(RADIANS(AA8))","v":0.92886987859960812},{"$f":"COS(RADIANS(Sight2!HC2_))*SIN(RADIANS(AA8))","v":0.19743738763398358},null,{"$f":"IF(AO8=0,RADIANS(90-Sight2!HO2_),IF(AO8=180,-RADIANS(90-Sight2!HO2_),IF(AO8<180,-RADIANS(90-Sight2!HO2_),RADIANS(90-Sight2!HO2_))))","v":-1.251194277580892},{"$f":"ACOS(COS(RADIANS(LatB2))*SIN(RADIANS(AO8)))","v":1.3322826154688525},{"$f":"IF(OR(AO8=0,AO8=180),RADIANS((LatLP2+LatB2)/2),IF(AND(LatB2=0,LatLP2=0),0,IF(LatB2>=0,AF8,-AF8)))","v":-1.3322826154688525},{"$f":"IF(COS(RADIANS(AO8))/SIN(AG8)>0,IF(1-COS(RADIANS(AO8))/SIN(AG8)<0.000000000001,1,COS(RADIANS(AO8))/SIN(AG8)),IF(1+COS(RADIANS(AO8))/SIN(AG8)<0.000000000001,-1,COS(RADIANS(AO8))/SIN(AG8)))","v":-0.99558987766612339},{"$f":"IF(AND(AO8<=180,AO8>0),IF(AH8=1,-PI()/2,IF(AH8=-1,PI()/2,-ASIN(AH8))),IF(AH8=1,PI()/2,IF(AH8=-1,-PI()/2,ASIN(AH8))))","v":1.4768456197058375},{"$f":"IF(OR(OR(AO8=0,AO8=180),AND(LatB2<>LatLP2,OR(AO8=90,AO8=270))),0,IF(AND(LatB2=0,LatLP2=0),RADIANS((LonLP2-LonB2)/2),AI8))","v":1.4768456197058375},{"$f":"IF(AJ8=0,AG8-RADIANS(LatB2),ASIN(COS(RADIANS(LatB2))*SIN(AJ8)))","v":1.1912950883020781},{"$f":"AE8-AK8","v":-2.4424893658829703},{"$f":"ASIN(SIN(AL8)/COS(RADIANS(AP8)))","v":-1.2968538885801466},{"$f":"IF(AL8>PI()/2,PI()-AM8,IF(AL8<-PI()/2,-PI()-AM8,AM8))","v":-1.8447387650096465},{"$f":"IF(AO9-dZB2_<0,360+(AO9-dZB2_),IF(AO9-dZB2_>=360,AO9-dZB2_-360,AO9-dZB2_))","v":14.668996270213519},{"$f":"IF(OR(AO8=0,AO8=180),LatB2+DEGREES(AE8),DEGREES(ASIN(SIN(AG8)*COS(AL8))))","v":48.051903777992742},{"$f":"DRLat2+AP8","v":48.051903777992742},{"$f":"IF(OR(LatB2=90,LatB2=-90),AR9-dZB2_,IF(OR(AO8=0,AO8=180),LonB2,LonB2+DEGREES(AJ8)+DEGREES(AN8)))","v":75.569785647483798},{"$f":"IF(AR8<0,360+AR8,AR8)","v":75.569785647483798},{"$f":"IF(AS8-GHAx2>180,cLOP2+(AS8-GHAx2-360),IF(AS8-GHAx2<-180,cLOP2+(AS8-GHAx2+360),cLOP2+(AS8-GHAx2)))","v":75.569785647483798},48.183925887688467]
[14,0.97029572627599647,0.24192189559966773,null,76,{"$f":"COS(RADIANS(E9))*COS(RADIANS(Sight2!LHA2_))","v":0.21925538225491606},0.97029572627599647,{"$f":"F9*COS(RADIANS(90-Sight2!LAT2_))-G9*SIN(RADIANS(90-Sight2!LAT2_))","v":-0.50138685868382149},{"$f":"F9*SIN(RADIANS(90-Sight2!LAT2_))+G9*COS(RADIANS(90-Sight2!LAT2_))","v":0.85916118220994042},null,{"$f":"COS(RADIANS(E9))*COS(RADIANS(Sight2!AZ_nord2-180))","v":0.22008277945145935},null,null,"Plot of Declination",null,null,0,1,null,14,{"$f":"COS(RADIANS(Sight2!DEC2_))*COS(RADIANS(T9))","v":0.9052509880952605},{"$f":"COS(RADIANS(Sight2!DEC2_))*SIN(RADIANS(T9))","v":0.22570442093360724},null,0,1,null,14,{"$f":"COS(RADIANS(Sight2!HC2_))*COS(RADIANS(AA9))","v":0.92141357070810681},{"$f":"COS(RADIANS(Sight2!HC2_))*SIN(RADIANS(AA9))","v":0.22973420537725611},null,{"$f":"IF(AO9=0,RADIANS(90-Sight2!HO2_),IF(AO9=180,-RADIANS(90-Sight2!HO2_),IF(AO9<180,-RADIANS(90-Sight2!HO2_),RADIANS(90-Sight2!HO2_))))","v":-1.251194277580892},1.3290405233474369,-1.3290405233474369,{"$f":"IF(COS(RADIANS(AO9))/SIN(AG9)>0,IF(1-COS(RADIANS(AO9))/SIN(AG9)<0.000000000001,1,COS(RADIANS(AO9))/SIN(AG9)),IF(1+COS(RADIANS(AO9))/SIN(AG9)<0.000000000001,-1,COS(RADIANS(AO9))/SIN(AG9)))","v":-0.99546404860411852},{"$f":"IF(AND(AO9<=180,AO9>0),IF(AH9=1,-PI()/2,IF(AH9=-1,PI()/2,-ASIN(AH9))),IF(AH9=1,PI()/2,IF(AH9=-1,-PI()/2,ASIN(AH9))))","v":1.475513750294301},1.475513750294301,1.1909783246523997,{"$f":"AE9-AK9","v":-2.4421726022332919},-1.2935552237550838,{"$f":"IF(AL9>PI()/2,PI()-AM9,IF(AL9<-PI()/2,-PI()-AM9,AM9))","v":-1.8480374298347093},14.868996270213518,47.98439254295927,47.98439254295927,75.30447557883582,{"$f":"IF(AR9<0,360+AR9,AR9)","v":75.30447557883582},75.30447557883582,48.1002877733943]
[16,0.96126169593831889,0.27563735581699916,null,74,{"$f":"COS(RADIANS(E10))*COS(RADIANS(Sight2!LHA2_))","v":0.24981192241234026},0.96126169593831889,{"$f":"F10*COS(RADIANS(90-Sight2!LAT2_))-G10*SIN(RADIANS(90-Sight2!LAT2_))","v":-0.47287802605596352},{"$f":"F10*SIN(RADIANS(90-Sight2!LAT2_))+G10*COS(RADIANS(90-Sight2!LAT2_))","v":0.87339362095848716},null,{"$f":"COS(RADIANS(E10))*COS(RADIANS(Sight2!AZ_nord2-180))","v":0.25075462987129216},null,null,{"$f":"COS(RADIANS(Sight2!DEC2_+90-Sight2!LAT2_))","v":0.92782540373157996},{"$f":"SIN(RADIANS(Sight2!DEC2_+90-Sight2!LAT2_))","v":0.37301477208058476},null,0,1.1000000000000001,-1.1000000000000001,16,{"$f":"COS(RADIANS(Sight2!DEC2_))*COS(RADIANS(T10))","v":0.89682256295826368},{"$f":"COS(RADIANS(Sight2!DEC2_))*SIN(RADIANS(T10))","v":0.2571597317726701},null,null,null,null,16,{"$f":"COS(RADIANS(Sight2!HC2_))*COS(RADIANS(AA10))","v":0.91283466231357768},{"$f":"COS(RADIANS(Sight2!HC2_))*SIN(RADIANS(AA10))","v":0.26175112737911799},null,{"$f":"IF(AO10=0,RADIANS(90-Sight2!HO2_),IF(AO10=180,-RADIANS(90-Sight2!HO2_),IF(AO10<180,-RADIANS(90-Sight2!HO2_),RADIANS(90-Sight2!HO2_))))","v":-1.251194277580892},1.3257988442153379,-1.3257988442153379,-0.99533624814037325,1.4741797498351241,1.4741797498351241,1.1906568552515913,-2.4418511328324835,-1.2902727982591931,-1.8513198553306001,15.068996270213518,47.916077770340557,47.916077770340557,75.039973855175788,75.039973855175788,75.039973855175788,48.016904487161639]
[18,0.95105651629515353,0.3090169943749474,null,72,{"$f":"COS(RADIANS(E11))*COS(RADIANS(Sight2!LHA2_))","v":0.28006410522288178},0.95105651629515353,{"$f":"F11*COS(RADIANS(90-Sight2!LAT2_))-G11*SIN(RADIANS(90-Sight2!LAT2_))","v":-0.44379306439463218},{"$f":"F11*SIN(RADIANS(90-Sight2!LAT2_))+G11*COS(RADIANS(90-Sight2!LAT2_))","v":0.88656196411586974},null,{"$f":"COS(RADIANS(E11))*COS(RADIANS(Sight2!AZ_nord2-180))","v":0.2811209744004165},null,null,{"$f":"COS(RADIANS(270-Sight2!DEC2_-Sight2!LAT2_))","v":-0.43682795525798745},{"$f":"SIN(RADIANS(270-Sight2!DEC2_-Sight2!LAT2_))","v":-0.89954507252562155},null,null,null,null,18,{"$f":"COS(RADIANS(Sight2!DEC2_))*COS(RADIANS(T11))","v":0.88730149767322775},{"$f":"COS(RADIANS(Sight2!DEC2_))*SIN(RADIANS(T11))","v":0.288301733090988},null,"Azimut line + label",null,null,18,{"$f":"COS(RADIANS(Sight2!HC2_))*COS(RADIANS(AA11))","v":0.90314360549441985},{"$f":"COS(RADIANS(Sight2!HC2_))*SIN(RADIANS(AA11))","v":0.29344914595193866},null,{"$f":"IF(AO11=0,RADIANS(90-Sight2!HO2_),IF(AO11=180,-RADIANS(90-Sight2!HO2_),IF(AO11<180,-RADIANS(90-Sight2!HO2_),RADIANS(90-Sight2!HO2_))))","v":-1.251194277580892},1.3225575845113835,-1.3225575845113835,-0.99520646479101971,1.472843585381471,1.472843585381471,1.1903306625643126,-2.4415249401452046,-1.2870067418883813,-1.8545859117014118,15.268996270213517,47.846963374146064,47.846963374146064,74.776286025546725,74.776286025546725,74.776286025546725,47.933777778307785]
[20,0.93969262078590843,0.34202014332566871,null,70,{"$f":"COS(RADIANS(E12))*COS(RADIANS(Sight2!LHA2_))","v":0.30997507306177746},0.93969262078590832,{"$f":"F12*COS(RADIANS(90-Sight2!LAT2_))-G12*SIN(RADIANS(90-Sight2!LAT2_))","v":-0.41416740924541695},{"$f":"F12*SIN(RADIANS(90-Sight2!LAT2_))+G12*COS(RADIANS(90-Sight2!LAT2_))","v":0.89865016808437892},null,{"$f":"COS(RADIANS(E12))*COS(RADIANS(Sight2!AZ_nord2-180))","v":0.31114481632560048},null,null,null,null,null,"LHA line + label",null,null,20,{"$f":"COS(RADIANS(Sight2!DEC2_))*COS(RADIANS(T12))","v":0.87669939219159521},{"$f":"COS(RADIANS(Sight2!DEC2_))*SIN(RADIANS(T12))","v":0.31909248315701211},null,0,0,null,20,{"$f":"COS(RADIANS(Sight2!HC2_))*COS(RADIANS(AA12))","v":0.89235220731057485},{"$f":"COS(RADIANS(Sight2!HC2_))*SIN(RADIANS(AA12))","v":0.3247896419427927},null,{"$f":"IF(AO12=0,RADIANS(90-Sight2!HO2_),IF(AO12=180,-RADIANS(90-Sight2!HO2_),IF(AO12<180,-RADIANS(90-Sight2!HO2_),RADIANS(90-Sight2!HO2_))))","v":-1.251194277580892},1.3193167507121286,-1.3193167507121286,-0.99507468687046119,1.4715052238047759,1.4715052238047759,1.1899997287698107,-2.4411940063507025,-1.2837571818261373,-1.8578354717636558,15.468996270213516,47.77705328843566,47.77705328843566,74.513417478898788,74.513417478898788,74.513417478898788,47.850909345681302]
[22,0.92718385456678742,0.37460659341591201,null,68,{"$f":"COS(RADIANS(E13))*COS(RADIANS(Sight2!LHA2_))","v":0.33950838402214689},0.92718385456678742,{"$f":"F13*COS(RADIANS(90-Sight2!LAT2_))-G13*SIN(RADIANS(90-Sight2!LAT2_))","v":-0.38403715490563517},{"$f":"F13*SIN(RADIANS(90-Sight2!LAT2_))+G13*COS(RADIANS(90-Sight2!LAT2_))","v":0.90964350524952375},null,{"$f":"COS(RADIANS(E13))*COS(RADIANS(Sight2!AZ_nord2-180))","v":0.34078957622027622},null,null,"Plot of Calculated ALTITUDE",null,null,0,0,null,22,{"$f":"COS(RADIANS(Sight2!DEC2_))*COS(RADIANS(T13))","v":0.86502916354576587},{"$f":"COS(RADIANS(Sight2!DEC2_))*SIN(RADIANS(T13))","v":0.34949446818473834},null,{"$f":"COS(RADIANS(90-Sight2!AZ_nord2))","v":-0.4152078323835619},{"$f":"SIN(RADIANS(90-Sight2!AZ_nord2))","v":-0.90972658306072596},null,22,{"$f":"COS(RADIANS(Sight2!HC2_))*COS(RADIANS(AA13))","v":0.88047361541844193},{"$f":"COS(RADIANS(Sight2!HC2_))*SIN(RADIANS(AA13))","v":0.3557344317849484},null,{"$f":"IF(AO13=0,RADIANS(90-Sight2!HO2_),IF(AO13=180,-RADIANS(90-Sight2!HO2_),IF(AO13<180,-RADIANS(90-Sight2!HO2_),RADIANS(90-Sight2!HO2_))))","v":-1.251194277580892},1.3160763493325152,-1.3160763493325152,-0.99494090248925182,1.4701646317916639,1.4701646317916639,1.189664035759741,-2.440858313340633,-1.2805242426586556,-1.8610684109311375,15.668996270213515,47.70635146641424,47.70635146641424,74.251373444779276,74.251373444779276,74.251373444779276,47.768300837879536]
[24,0.91354545764260087,0.40673664307580021,null,66,{"$f":"COS(RADIANS(E14))*COS(RADIANS(Sight2!LHA2_))","v":0.36862805631384293},0.91354545764260087,{"$f":"F14*COS(RADIANS(90-Sight2!LAT2_))-G14*SIN(RADIANS(90-Sight2!LAT2_))","v":-0.35343901044898945},{"$f":"F14*SIN(RADIANS(90-Sight2!LAT2_))+G14*COS(RADIANS(90-Sight2!LAT2_))","v":0.91952858192336251},null,{"$f":"COS(RADIANS(E14))*COS(RADIANS(Sight2!AZ_nord2-180))","v":0.37001913651093782},null,null,{"$f":"COS(RADIANS(Sight2!HC2_))","v":0.94962138423973086},{"$f":"SIN(RADIANS(Sight2!HC2_))","v":0.31339946808285668},null,{"$f":"COS(RADIANS(90+Sight2!LHA2_))","v":-0.42262105919099158},{"$f":"SIN(RADIANS(90+Sight2!LHA2_))","v":0.90630648255889923},null,24,{"$f":"COS(RADIANS(Sight2!DEC2_))*COS(RADIANS(T14))","v":0.8523050301116839},{"$f":"COS(RADIANS(Sight2!DEC2_))*SIN(RADIANS(T14))","v":0.37947064803847735},null,{"$f":"1.1*COS(RADIANS(90-Sight2!AZ_nord2))","v":-0.45672861562191813},{"$f":"1.1*SIN(RADIANS(90-Sight2!AZ_nord2))","v":-1.0006992413667986},null,24,{"$f":"COS(RADIANS(Sight2!HC2_))*COS(RADIANS(AA14))","v":0.86752230205248504},{"$f":"COS(RADIANS(Sight2!HC2_))*SIN(RADIANS(AA14))","v":0.38624581401866276},null,{"$f":"IF(AO14=0,RADIANS(90-Sight2!HO2_),IF(AO14=180,-RADIANS(90-Sight2!HO2_),IF(AO14<180,-RADIANS(90-Sight2!HO2_),RADIANS(90-Sight2!HO2_))))","v":-1.251194277580892},1.3128363869265396,-1.3128363869265396,-0.99480509955193352,1.468821775840804,1.468821775840804,1.1893235651359386,-2.4405178427168304,-1.2773080463909949,-1.8642846071987982,15.868996270213515,47.634861879532842,47.634861879532842,73.990158994078286,73.990158994078286,73.990158994078286,47.685953853483682]
[26,0.89879404629916704,0.4383711467890774,null,64,{"$f":"COS(RADIANS(E15))*COS(RADIANS(Sight2!LHA2_))","v":0.39729861210171968},0.89879404629916704,{"$f":"F15*COS(RADIANS(90-Sight2!LAT2_))-G15*SIN(RADIANS(90-Sight2!LAT2_))","v":-0.32241025500121756},{"$f":"F15*SIN(RADIANS(90-Sight2!LAT2_))+G15*COS(RADIANS(90-Sight2!LAT2_))","v":0.92829335466264751},null,{"$f":"COS(RADIANS(E15))*COS(RADIANS(Sight2!AZ_nord2-180))","v":0.39879788548083939},null,null,{"$f":"COS(RADIANS(180-Sight2!HC2_))","v":-0.94962138423973075},{"$f":"SIN(RADIANS(180-Sight2!HC2_))","v":0.3133994680828569},null,{"$f":"1.1*COS(RADIANS(90+Sight2!LHA2_))","v":-0.46488316511009076},{"$f":"1.1*SIN(RADIANS(90+Sight2!LHA2_))","v":0.99693713081478919},null,26,{"$f":"COS(RADIANS(Sight2!DEC2_))*COS(RADIANS(T15))","v":0.83854249428593641},{"$f":"COS(RADIANS(Sight2!DEC2_))*SIN(RADIANS(T15))","v":0.40898450136055375},null,null,null,null,26,{"$f":"COS(RADIANS(Sight2!HC2_))*COS(RADIANS(AA15))","v":0.85351404639304373},{"$f":"COS(RADIANS(Sight2!HC2_))*SIN(RADIANS(AA15))","v":0.41628661522460192},null,{"$f":"IF(AO15=0,RADIANS(90-Sight2!HO2_),IF(AO15=180,-RADIANS(90-Sight2!HO2_),IF(AO15<180,-RADIANS(90-Sight2!HO2_),RADIANS(90-Sight2!HO2_))))","v":-1.251194277580892},1.3095968700879284,-1.3095968700879284,-0.99466726575483,1.4674766222597484,1.4674766222597484,1.1889782982081576,-2.4401725757890498,-1.2741087124642407,-1.8674839411255524,16.068996270213514,47.562588516598126,47.562588516598126,73.729779039830873,73.729779039830873,73.729779039830873,47.603869941311657]
[28,0.88294759285892699,0.46947156278589081,null,62,{"$f":"COS(RADIANS(E16))*COS(RADIANS(Sight2!LHA2_))","v":0.42548512072991018},0.88294759285892688,{"$f":"F16*COS(RADIANS(90-Sight2!LAT2_))-G16*SIN(RADIANS(90-Sight2!LAT2_))","v":-0.29098869232121927},{"$f":"F16*SIN(RADIANS(90-Sight2!LAT2_))+G16*COS(RADIANS(90-Sight2!LAT2_))","v":0.93592714494190532},null,{"$f":"COS(RADIANS(E16))*COS(RADIANS(Sight2!AZ_nord2-180))","v":0.42709076065738755},null,null,null,null,null,null,null,null,28,{"$f":"COS(RADIANS(Sight2!DEC2_))*COS(RADIANS(T16))","v":0.82375832359847068},{"$f":"COS(RADIANS(Sight2!DEC2_))*SIN(RADIANS(T16))","v":0.43800007006695535},null,null,null,null,28,{"$f":"COS(RADIANS(Sight2!HC2_))*COS(RADIANS(AA16))","v":0.83846591534183257},{"$f":"COS(RADIANS(Sight2!HC2_))*SIN(RADIANS(AA16))","v":0.44582023531392734},null,{"$f":"IF(AO16=0,RADIANS(90-Sight2!HO2_),IF(AO16=180,-RADIANS(90-Sight2!HO2_),IF(AO16<180,-RADIANS(90-Sight2!HO2_),RADIANS(90-Sight2!HO2_))))","v":-1.251194277580892},1.3063578054508183,-1.3063578054508183,-0.9945273885837993,1.4661291371617422,1.4661291371617422,1.1886282159917665,-2.4398224935726587,-1.270926357773619,-1.8706662958161742,16.268996270213513,47.489535382888796,47.489535382888796,73.470238338072051,73.470238338072051,73.470238338072051,47.522050600687635]
[30,0.86602540378443871,0.49999999999999994,null,60,{"$f":"COS(RADIANS(E17))*COS(RADIANS(Sight2!LHA2_))","v":0.45315324127944973},0.8660254037844386,{"$f":"F17*COS(RADIANS(90-Sight2!LAT2_))-G17*SIN(RADIANS(90-Sight2!LAT2_))","v":-0.25921260474299956},{"$f":"F17*SIN(RADIANS(90-Sight2!LAT2_))+G17*COS(RADIANS(90-Sight2!LAT2_))","v":0.94242065216357629},null,{"$f":"COS(RADIANS(E17))*COS(RADIANS(Sight2!AZ_nord2-180))","v":0.45486329153036309},null,null,"Zénith",null,null,"Greenwich line + label",null,null,30,{"$f":"COS(RADIANS(Sight2!DEC2_))*COS(RADIANS(T17))","v":0.80797053028394261},{"$f":"COS(RADIANS(Sight2!DEC2_))*SIN(RADIANS(T17))","v":0.46648200315671884},null,"Cardinal points",null,null,30,{"$f":"COS(RADIANS(Sight2!HC2_))*COS(RADIANS(AA17))","v":0.8223962427285505},{"$f":"COS(RADIANS(Sight2!HC2_))*SIN(RADIANS(AA17))","v":0.47481069211986537},null,{"$f":"IF(AO17=0,RADIANS(90-Sight2!HO2_),IF(AO17=180,-RADIANS(90-Sight2!HO2_),IF(AO17<180,-RADIANS(90-Sight2!HO2_),RADIANS(90-Sight2!HO2_))))","v":-1.251194277580892},1.3031191996904465,-1.3031191996904465,-0.99438545531194056,1.46477928646248,1.46477928646248,1.188273299205401,-2.439467576786293,-1.2677610966875765,-1.8738315569022166,16.468996270213513,47.415706499280802,47.415706499280802,73.211541488744317,73.211541488744317,73.211541488744317,47.440497281728142]
[32,0.84804809615642596,0.5299192642332049,null,58,{"$f":"COS(RADIANS(E18))*COS(RADIANS(Sight2!LHA2_))","v":0.48026926440739581},0.84804809615642596,{"$f":"F18*COS(RADIANS(90-Sight2!LAT2_))-G18*SIN(RADIANS(90-Sight2!LAT2_))","v":-0.22712070653454147},{"$f":"F18*SIN(RADIANS(90-Sight2!LAT2_))+G18*COS(RADIANS(90-Sight2!LAT2_))","v":0.94776596498935883},null,{"$f":"COS(RADIANS(E18))*COS(RADIANS(Sight2!AZ_nord2-180))","v":0.48208164154892746},null,null,0,1.2,null,0,0,null,32,{"$f":"COS(RADIANS(Sight2!DEC2_))*COS(RADIANS(T18))","v":0.79119834933658273},{"$f":"COS(RADIANS(Sight2!DEC2_))*SIN(RADIANS(T18))","v":0.49439559978168007},null,-1.1499999999999999,0,"W",32,{"$f":"COS(RADIANS(Sight2!HC2_))*COS(RADIANS(AA18))","v":0.8053246069739336},{"$f":"COS(RADIANS(Sight2!HC2_))*SIN(RADIANS(AA18))","v":0.50322266523643577},null,{"$f":"IF(AO18=0,RADIANS(90-Sight2!HO2_),IF(AO18=180,-RADIANS(90-Sight2!HO2_),IF(AO18<180,-RADIANS(90-Sight2!HO2_),RADIANS(90-Sight2!HO2_))))","v":-1.251194277580892},1.2998810595238468,-1.2998810595238468,-0.99424145299725863,1.4634270358768724,1.4634270358768724,1.1879135282685862,-2.4391078058494782,-1.2646130410677481,-1.876979612522045,16.668996270213512,47.341105901380942,47.341105901380942,72.953692936656296,72.953692936656296,72.953692936656296,47.359211385644272]
[34,0.82903757255504162,0.5591929034707469,null,56,{"$f":"COS(RADIANS(E19))*COS(RADIANS(Sight2!LHA2_))","v":0.50680015341647056},0.82903757255504174,{"$f":"F19*COS(RADIANS(90-Sight2!LAT2_))-G19*SIN(RADIANS(90-Sight2!LAT2_))","v":-0.19475209673043381},{"$f":"F19*SIN(RADIANS(90-Sight2!LAT2_))+G19*COS(RADIANS(90-Sight2!LAT2_))","v":0.95195657097895703},null,{"$f":"COS(RADIANS(E19))*COS(RADIANS(Sight2!AZ_nord2-180))","v":0.50871264934624882},null,null,null,null,null,{"$f":"COS(RADIANS(90-Sight2!LON2_))","v":0.94914194788377726},{"$f":"SIN(RADIANS(90-Sight2!LON2_))","v":0.31484847588544729},null,34,{"$f":"COS(RADIANS(Sight2!DEC2_))*COS(RADIANS(T19))","v":0.77346221507531898},{"$f":"COS(RADIANS(Sight2!DEC2_))*SIN(RADIANS(T19))","v":0.52170685152411156},null,0,1.1499999999999999,"N",34,{"$f":"COS(RADIANS(Sight2!HC2_))*COS(RADIANS(AA19))","v":0.78727180723646495},{"$f":"COS(RADIANS(Sight2!HC2_))*SIN(RADIANS(AA19))","v":0.53102153905092486},null,{"$f":"IF(AO19=0,RADIANS(90-Sight2!HO2_),IF(AO19=180,-RADIANS(90-Sight2!HO2_),IF(AO19<180,-RADIANS(90-Sight2!HO2_),RADIANS(90-Sight2!HO2_))))","v":-1.251194277580892},1.2966433917105544,-1.2966433917105544,-0.99409536848028068,1.4620723509157287,1.4620723509157287,1.187548883299302,-2.4387431608801942,-1.2614823002898408,-1.8801103532999524,16.868996270213511,47.265737638668746,47.265737638668746,72.696696972489335,72.696696972489335,72.696696972489335,47.278194265059014]
[36,0.80901699437494745,0.58778525229247314,null,54,{"$f":"COS(RADIANS(E20))*COS(RADIANS(Sight2!LHA2_))","v":0.53271358450518647},0.80901699437494745,{"$f":"F20*COS(RADIANS(90-Sight2!LAT2_))-G20*SIN(RADIANS(90-Sight2!LAT2_))","v":-0.16214621149572084},{"$f":"F20*SIN(RADIANS(90-Sight2!LAT2_))+G20*COS(RADIANS(90-Sight2!LAT2_))","v":0.95498736452448585},null,{"$f":"COS(RADIANS(E20))*COS(RADIANS(Sight2!AZ_nord2-180))","v":0.53472386914151837},null,null,"Horizon",null,null,{"$f":"-COS(RADIANS(90-Sight2!LON2_))","v":-0.94914194788377726},{"$f":"-SIN(RADIANS(90-Sight2!LON2_))","v":-0.31484847588544729},null,36,{"$f":"COS(RADIANS(Sight2!DEC2_))*COS(RADIANS(T20))","v":0.75478373624770689},{"$f":"COS(RADIANS(Sight2!DEC2_))*SIN(RADIANS(T20))","v":0.54838248383074051},null,1.1499999999999999,0,"E",36,{"$f":"COS(RADIANS(Sight2!HC2_))*COS(RADIANS(AA20))","v":0.7682598380718042},{"$f":"COS(RADIANS(Sight2!HC2_))*SIN(RADIANS(AA20))","v":0.55817344491767773},null,{"$f":"IF(AO20=0,RADIANS(90-Sight2!HO2_),IF(AO20=180,-RADIANS(90-Sight2!HO2_),IF(AO20<180,-RADIANS(90-Sight2!HO2_),RADIANS(90-Sight2!HO2_))))","v":-1.251194277580892},1.2934062030533173,-1.2934062030533173,-0.99394718838163076,1.4607151968824514,1.4607151968824514,1.1871793441115197,-2.4383736216924117,-1.2583689812653425,-1.8832236723244506,17.068996270213511,47.189605773647713,47.189605773647713,72.440557733851833,72.440557733851833,72.440557733851833,47.197447224339612]
[38,0.7880107536067219,0.61566147532565829,null,52,{"$f":"COS(RADIANS(E21))*COS(RADIANS(Sight2!LHA2_))","v":0.55797798614941985},0.78801075360672201,{"$f":"F21*COS(RADIANS(90-Sight2!LAT2_))-G21*SIN(RADIANS(90-Sight2!LAT2_))","v":-0.12934277607900951},{"$f":"F21*SIN(RADIANS(90-Sight2!LAT2_))+G21*COS(RADIANS(90-Sight2!LAT2_))","v":0.95685465307086814},null,{"$f":"COS(RADIANS(E21))*COS(RADIANS(Sight2!AZ_nord2-180))","v":0.56008361027013653},null,null,1.3,0,null,{"$f":"1.1*COS(RADIANS(90-Sight2!LON2_))","v":1.0440561426721551},{"$f":"1.1*SIN(RADIANS(90-Sight2!LON2_))","v":0.34633332347399204},null,38,{"$f":"COS(RADIANS(Sight2!DEC2_))*COS(RADIANS(T21))","v":0.73518566970299859},{"$f":"COS(RADIANS(Sight2!DEC2_))*SIN(RADIANS(T21))","v":0.57438999655266787},null,0,-1.1499999999999999,"S",38,{"$f":"COS(RADIANS(Sight2!HC2_))*COS(RADIANS(AA21))","v":0.74831186263580873},{"$f":"COS(RADIANS(Sight2!HC2_))*SIN(RADIANS(AA21))","v":0.58464530242182655},null,{"$f":"IF(AO21=0,RADIANS(90-Sight2!HO2_),IF(AO21=180,-RADIANS(90-Sight2!HO2_),IF(AO21<180,-RADIANS(90-Sight2!HO2_),RADIANS(90-Sight2!HO2_))))","v":-1.251194277580892},1.2901695003988178,-1.2901695003988178,-0.99379689909955382,1.4593555388696691,1.4593555388696691,1.1868048902126911,-2.4379991677935831,-1.2552731884640911,-1.886319465125702,17.26899627021351,47.112714381005929,47.112714381005929,72.185279206379576,72.185279206379576,72.185279206379576,47.116971519944464]
[40,0.76604444311897801,0.64278760968653925,null,50,{"$f":"COS(RADIANS(E22))*COS(RADIANS(Sight2!LHA2_))","v":0.58256257756745011},0.76604444311897801,{"$f":"F22*COS(RADIANS(90-Sight2!LAT2_))-G22*SIN(RADIANS(90-Sight2!LAT2_))","v":-9.6381756413373154E-2},{"$f":"F22*SIN(RADIANS(90-Sight2!LAT2_))+G22*COS(RADIANS(90-Sight2!LAT2_))","v":0.95755616161464374},null,{"$f":"COS(RADIANS(E22))*COS(RADIANS(Sight2!AZ_nord2-180))","v":0.58476097579390707},null,null,-1.3,0,null,{"$f":"-1.1*COS(RADIANS(90-Sight2!LON2_))","v":-1.0440561426721551},{"$f":"-1.1*SIN(RADIANS(90-Sight2!LON2_))","v":-0.34633332347399204},null,40,{"$f":"COS(RADIANS(Sight2!DEC2_))*COS(RADIANS(T22))","v":0.71469189266642819},{"$f":"COS(RADIANS(Sight2!DEC2_))*SIN(RADIANS(T22))","v":0.59969770354179197},null,null,null,null,40,{"$f":"COS(RADIANS(Sight2!HC2_))*COS(RADIANS(AA22))","v":0.72745218446379767},{"$f":"COS(RADIANS(Sight2!HC2_))*SIN(RADIANS(AA22))","v":0.61040485968267921},null,{"$f":"IF(AO22=0,RADIANS(90-Sight2!HO2_),IF(AO22=180,-RADIANS(90-Sight2!HO2_),IF(AO22<180,-RADIANS(90-Sight2!HO2_),RADIANS(90-Sight2!HO2_))))","v":-1.251194277580892},1.286933290638399,-1.286933290638399,-0.99364448680739614,1.4579933417558451,1.4579933417558451,1.1864255008011928,-2.4376197783820848,-1.2521950239376247,-1.8893976296521684,17.468996270213509,47.03506754678569,47.03506754678569,71.93086522487917,71.93086522487917,71.93086522487917,47.036768360783554]
[42,0.74314482547739424,0.66913060635885824,null,48,{"$f":"COS(RADIANS(E23))*COS(RADIANS(Sight2!LHA2_))","v":0.60643740622160025},0.74314482547739424,{"$f":"F23*COS(RADIANS(90-Sight2!LAT2_))-G23*SIN(RADIANS(90-Sight2!LAT2_))","v":-6.33033104240186E-2},{"$f":"F23*SIN(RADIANS(90-Sight2!LAT2_))+G23*COS(RADIANS(90-Sight2!LAT2_))","v":0.95709103547571128},null,{"$f":"COS(RADIANS(E23))*COS(RADIANS(Sight2!AZ_nord2-180))","v":0.60872590014419581},null,null,null,null,null,null,null,null,42,{"$f":"COS(RADIANS(Sight2!DEC2_))*COS(RADIANS(T23))","v":0.69332737364849029},{"$f":"COS(RADIANS(Sight2!DEC2_))*SIN(RADIANS(T23))","v":0.62427477125550024},null,"Azimut North 2",null,null,42,{"$f":"COS(RADIANS(Sight2!HC2_))*COS(RADIANS(AA23))","v":0.7057062178604363},{"$f":"COS(RADIANS(Sight2!HC2_))*SIN(RADIANS(AA23))","v":0.63542073264766941},null,{"$f":"IF(AO23=0,RADIANS(90-Sight2!HO2_),IF(AO23=180,-RADIANS(90-Sight2!HO2_),IF(AO23<180,-RADIANS(90-Sight2!HO2_),RADIANS(90-Sight2!HO2_))))","v":-1.251194277580892},1.2836975807088034,-1.2836975807088034,-0.9934899374510352,1.456628570201852,1.456628570201852,1.1860411547637324,-2.4372354323446244,-1.2491345873433148,-1.8924580662464783,{"$f":"IF(ZB2N>=360,ZB2N-360,ZB2N)","v":17.668996270213508},46.956669367563265,46.956669367563265,{"$f":"IF(OR(LatB2=90,LatB2=-90),LonLP2,IF(OR(AO23=0,AO23=180),LonB2,LonB2+DEGREES(AJ23)+DEGREES(AN23)))","v":71.677319474514505},71.677319474514505,{"$f":"IF(DRLon2+Sight2!LON2_<0,DRLon2+GHAx2-360,DRLon2+GHAx2)","v":71.677319474514505},46.956838908592516]
[44,0.71933980033865119,0.69465837045899725,null,46,{"$f":"COS(RADIANS(E24))*COS(RADIANS(Sight2!LHA2_))","v":0.62957338431079057},0.71933980033865108,{"$f":"F24*COS(RADIANS(90-Sight2!LAT2_))-G24*SIN(RADIANS(90-Sight2!LAT2_))","v":-3.0147739102039828E-2},{"$f":"F24*SIN(RADIANS(90-Sight2!LAT2_))+G24*COS(RADIANS(90-Sight2!LAT2_))","v":0.95545984133862372},null,{"$f":"COS(RADIANS(E24))*COS(RADIANS(Sight2!AZ_nord2-180))","v":0.6319491857521955},null,null,null,null,null,"Sun line + label",null,null,44,{"$f":"COS(RADIANS(Sight2!DEC2_))*COS(RADIANS(T24))","v":0.67111814202465647},{"$f":"COS(RADIANS(Sight2!DEC2_))*SIN(RADIANS(T24))","v":0.64809125632259035},null,{"$f":"Sight2!AZ_nord2","v":204.53240535865166},null,null,44,{"$f":"COS(RADIANS(Sight2!HC2_))*COS(RADIANS(AA24))","v":0.6831004569363216},{"$f":"COS(RADIANS(Sight2!HC2_))*SIN(RADIANS(AA24))","v":0.65966244332898871},null,{"$f":"IF(AO24=0,RADIANS(90-Sight2!HO2_),IF(AO24=180,-RADIANS(90-Sight2!HO2_),IF(AO24<180,-RADIANS(90-Sight2!HO2_),RADIANS(90-Sight2!HO2_))))","v":-1.251194277580892},1.2804623775929158,-1.2804623775929158,-0.99333323674626228,1.455261188647504,1.455261188647504,1.1856518306727046,-2.4368461082535964,-1.2460919759692441,-1.895500677620549,{"$f":"IF(AO23+dZB2_<0,360+(AO23+dZB2_),IF(AO23+dZB2_>=360,AO23+dZB2_-360,AO23+dZB2_))","v":17.868996270213508},46.877523949638359,46.877523949638359,{"$f":"IF(OR(LatB2=90,LatB2=-90),AR23+dZB2_,IF(OR(AO24=0,AO24=180),LonB2,LonB2+DEGREES(AJ24)+DEGREES(AN24)))","v":71.424645492033576},71.424645492033576,{"$f":"IF(AS24-GHAx2>180,cLOP2+(AS24-GHAx2-360),IF(AS24-GHAx2<-180,cLOP2+(AS24-GHAx2+360),cLOP2+(AS24-GHAx2)))","v":71.424645492033576},46.877184278319348]
[46,0.69465837045899725,0.71933980033865108,null,44,{"$f":"COS(RADIANS(E25))*COS(RADIANS(Sight2!LHA2_))","v":0.65194232420954379},0.69465837045899725,{"$f":"F25*COS(RADIANS(90-Sight2!LAT2_))-G25*SIN(RADIANS(90-Sight2!LAT2_))","v":3.0445625961315059E-3},{"$f":"F25*SIN(RADIANS(90-Sight2!LAT2_))+G25*COS(RADIANS(90-Sight2!LAT2_))","v":0.95266456656217124},null,{"$f":"COS(RADIANS(E25))*COS(RADIANS(Sight2!AZ_nord2-180))","v":0.65440253862166597},null,null,null,null,null,0,0,null,46,{"$f":"COS(RADIANS(Sight2!DEC2_))*COS(RADIANS(T25))","v":0.64809125632259035},{"$f":"COS(RADIANS(Sight2!DEC2_))*SIN(RADIANS(T25))","v":0.67111814202465636},null,null,null,null,46,{"$f":"COS(RADIANS(Sight2!HC2_))*COS(RADIANS(AA25))","v":0.65966244332898871},{"$f":"COS(RADIANS(Sight2!HC2_))*SIN(RADIANS(AA25))","v":0.68310045693632149},null,{"$f":"IF(AO25=0,RADIANS(90-Sight2!HO2_),IF(AO25=180,-RADIANS(90-Sight2!HO2_),IF(AO25<180,-RADIANS(90-Sight2!HO2_),RADIANS(90-Sight2!HO2_))))","v":-1.251194277580892},1.2772276883205191,-1.2772276883205191,-0.99317437017611498,1.4538911613080607,1.4538911613080607,1.1852575067835069,-2.4364517843643991,-1.2430672847598019,-1.8985253688299912,18.068996270213507,46.797635408233845,46.797635408233845,71.172846667034577,71.172846667034577,71.172846667034577,46.79780553852359]
[48,0.66913060635885824,0.74314482547739424,null,42,{"$f":"COS(RADIANS(E26))*COS(RADIANS(Sight2!LHA2_))","v":0.67351697281026424},0.66913060635885824,{"$f":"F26*COS(RADIANS(90-Sight2!LAT2_))-G26*SIN(RADIANS(90-Sight2!LAT2_))","v":3.6233154963758396E-2},{"$f":"F26*SIN(RADIANS(90-Sight2!LAT2_))+G26*COS(RADIANS(90-Sight2!LAT2_))","v":0.9487086167580896},null,{"$f":"COS(RADIANS(E26))*COS(RADIANS(Sight2!AZ_nord2-180))","v":0.67605860280080943},null,null,null,null,null,{"$f":"COS(RADIANS(270-Sight2!LON2_+UTday2*360))","v":-0.46101309481282765},{"$f":"SIN(RADIANS(270-Sight2!LON2_+UTday2*360))","v":-0.88739333241302798},null,48,{"$f":"COS(RADIANS(Sight2!DEC2_))*COS(RADIANS(T26))","v":0.62427477125550024},{"$f":"COS(RADIANS(Sight2!DEC2_))*SIN(RADIANS(T26))","v":0.69332737364849029},null,null,null,null,48,{"$f":"COS(RADIANS(Sight2!HC2_))*COS(RADIANS(AA26))","v":0.63542073264766941},{"$f":"COS(RADIANS(Sight2!HC2_))*SIN(RADIANS(AA26))","v":0.7057062178604363},null,{"$f":"IF(AO26=0,RADIANS(90-Sight2!HO2_),IF(AO26=180,-RADIANS(90-Sight2!HO2_),IF(AO26<180,-RADIANS(90-Sight2!HO2_),RADIANS(90-Sight2!HO2_))))","v":-1.251194277580892},1.2739935199690553,-1.2739935199690553,-0.99301332298815992,1.4525184521706971,1.4525184521706971,1.1848581610318136,-2.4360524386127054,-1.2400606063419688,-1.9015320472478243,18.268996270213506,46.717007866705828,46.717007866705828,70.921926243269695,70.921926243269695,70.921926243269695,46.718703711787292]
[50,0.64278760968653936,0.76604444311897801,null,40,{"$f":"COS(RADIANS(E27))*COS(RADIANS(Sight2!LHA2_))","v":0.69427104472695167},0.64278760968653925,{"$f":"F27*COS(RADIANS(90-Sight2!LAT2_))-G27*SIN(RADIANS(90-Sight2!LAT2_))","v":6.9377602813351591E-2},{"$f":"F27*SIN(RADIANS(90-Sight2!LAT2_))+G27*COS(RADIANS(90-Sight2!LAT2_))","v":0.94359681164184761},null,{"$f":"COS(RADIANS(E27))*COS(RADIANS(Sight2!AZ_nord2-180))","v":0.69689099371128449},null,null,null,null,null,{"$f":"1.1*COS(RADIANS(270-Sight2!LON2_+UTday2*360))","v":-0.50711440429411048},{"$f":"1.1*SIN(RADIANS(270-Sight2!LON2_+UTday2*360))","v":-0.97613266565433088},null,50,{"$f":"COS(RADIANS(Sight2!DEC2_))*COS(RADIANS(T27))","v":0.59969770354179208},{"$f":"COS(RADIANS(Sight2!DEC2_))*SIN(RADIANS(T27))","v":0.71469189266642819},null,null,null,null,50,{"$f":"COS(RADIANS(Sight2!HC2_))*COS(RADIANS(AA27))","v":0.61040485968267932},{"$f":"COS(RADIANS(Sight2!HC2_))*SIN(RADIANS(AA27))","v":0.72745218446379767},null,{"$f":"IF(AO27=0,RADIANS(90-Sight2!HO2_),IF(AO27=180,-RADIANS(90-Sight2!HO2_),IF(AO27<180,-RADIANS(90-Sight2!HO2_),RADIANS(90-Sight2!HO2_))))","v":-1.251194277580892},1.2707598796643971,-1.2707598796643971,-0.99285008019172349,1.451143024990911,1.451143024990911,1.1844537710307923,-2.435648048611684,-1.2370720310522636,-1.9045206225375295,18.468996270213506,46.635645455764013,46.635645455764013,70.671887319983156,70.671887319983156,70.671887319983156,46.639879775136862]
[52,0.61566147532565829,0.78801075360672201,null,38,{"$f":"COS(RADIANS(E28))*COS(RADIANS(Sight2!LHA2_))","v":0.7141792543198956},0.61566147532565829,{"$f":"F28*COS(RADIANS(90-Sight2!LAT2_))-G28*SIN(RADIANS(90-Sight2!LAT2_))","v":0.10243752474071727},{"$f":"F28*SIN(RADIANS(90-Sight2!LAT2_))+G28*COS(RADIANS(90-Sight2!LAT2_))","v":0.93733537916056653},null,{"$f":"COS(RADIANS(E28))*COS(RADIANS(Sight2!AZ_nord2-180))","v":0.71687433029375081},null,null,null,null,null,null,null,null,52,{"$f":"COS(RADIANS(Sight2!DEC2_))*COS(RADIANS(T28))","v":0.57438999655266787},{"$f":"COS(RADIANS(Sight2!DEC2_))*SIN(RADIANS(T28))","v":0.7351856697029987},null,null,null,null,52,{"$f":"COS(RADIANS(Sight2!HC2_))*COS(RADIANS(AA28))","v":0.58464530242182655},{"$f":"COS(RADIANS(Sight2!HC2_))*SIN(RADIANS(AA28))","v":0.74831186263580884},null,{"$f":"IF(AO28=0,RADIANS(90-Sight2!HO2_),IF(AO28=180,-RADIANS(90-Sight2!HO2_),IF(AO28<180,-RADIANS(90-Sight2!HO2_),RADIANS(90-Sight2!HO2_))))","v":-1.251194277580892},1.2675267745816283,-1.2675267745816283,-0.9926846265550725,1.4497648432889321,1.4497648432889321,1.1840443140682888,-2.4352385916491808,-1.2341016469643298,-1.9074910066254633,18.668996270213505,46.553552312703104,46.553552312703104,70.422732853286178,70.422732853286178,70.422732853286178,46.56133466047649]
[54,0.58778525229247314,0.80901699437494745,null,36,{"$f":"COS(RADIANS(E29))*COS(RADIANS(Sight2!LHA2_))","v":0.73321734650233139},0.58778525229247314,{"$f":"F29*COS(RADIANS(90-Sight2!LAT2_))-G29*SIN(RADIANS(90-Sight2!LAT2_))","v":0.1353726423234774},{"$f":"F29*SIN(RADIANS(90-Sight2!LAT2_))+G29*COS(RADIANS(90-Sight2!LAT2_))","v":0.92993194790522482},null,{"$f":"COS(RADIANS(E29))*COS(RADIANS(Sight2!AZ_nord2-180))","v":0.73598426593077948},null,null,null,null,null,"GHAy line + label",null,null,54,{"$f":"COS(RADIANS(Sight2!DEC2_))*COS(RADIANS(T29))","v":0.54838248383074051},{"$f":"COS(RADIANS(Sight2!DEC2_))*SIN(RADIANS(T29))","v":0.75478373624770689},null,null,null,null,54,{"$f":"COS(RADIANS(Sight2!HC2_))*COS(RADIANS(AA29))","v":0.55817344491767773},{"$f":"COS(RADIANS(Sight2!HC2_))*SIN(RADIANS(AA29))","v":0.7682598380718042},null,{"$f":"IF(AO29=0,RADIANS(90-Sight2!HO2_),IF(AO29=180,-RADIANS(90-Sight2!HO2_),IF(AO29<180,-RADIANS(90-Sight2!HO2_),RADIANS(90-Sight2!HO2_))))","v":-1.251194277580892},1.2642942119458342,-1.2642942119458342,-0.99251694660253964,1.448383870346059,1.448383870346059,1.1836297671039568,-2.4348240446848486,-1.2311495399171217,-1.9104431136726714,18.868996270213504,46.470732580644714,46.470732580644714,70.174465657561967,70.174465657561967,70.174465657561967,46.483069255031118]
[56,0.55919290347074679,0.82903757255504174,null,34,{"$f":"COS(RADIANS(E30))*COS(RADIANS(Sight2!LHA2_))","v":0.75136212629152799},0.5591929034707469,{"$f":"F30*COS(RADIANS(90-Sight2!LAT2_))-G30*SIN(RADIANS(90-Sight2!LAT2_))","v":0.16814282919412321},{"$f":"F30*SIN(RADIANS(90-Sight2!LAT2_))+G30*COS(RADIANS(90-Sight2!LAT2_))","v":0.92139553781639616},null,{"$f":"COS(RADIANS(E30))*COS(RADIANS(Sight2!AZ_nord2-180))","v":0.75419751810945668},null,null,null,null,null,0,0,null,56,{"$f":"COS(RADIANS(Sight2!DEC2_))*COS(RADIANS(T30))","v":0.52170685152411145},{"$f":"COS(RADIANS(Sight2!DEC2_))*SIN(RADIANS(T30))","v":0.77346221507531909},null,null,null,null,56,{"$f":"COS(RADIANS(Sight2!HC2_))*COS(RADIANS(AA30))","v":0.53102153905092475},{"$f":"COS(RADIANS(Sight2!HC2_))*SIN(RADIANS(AA30))","v":0.78727180723646506},null,{"$f":"IF(AO30=0,RADIANS(90-Sight2!HO2_),IF(AO30=180,-RADIANS(90-Sight2!HO2_),IF(AO30<180,-RADIANS(90-Sight2!HO2_),RADIANS(90-Sight2!HO2_))))","v":-1.251194277580892},1.2610621990328996,-1.2610621990328996,-0.99234702461159807,1.4470000692009732,1.4470000692009732,1.1832101067663419,-2.4344043843472338,-1.2282157935436819,-1.9133768600461112,19.068996270213503,46.387190407790577,46.387190407790577,69.927088406903238,69.927088406903238,69.927088406903238,46.405084401799542]
[58,0.5299192642332049,0.84804809615642596,null,32,{"$f":"COS(RADIANS(E31))*COS(RADIANS(Sight2!LHA2_))","v":0.7685914870683016},0.5299192642332049,{"$f":"F31*COS(RADIANS(90-Sight2!LAT2_))-G31*SIN(RADIANS(90-Sight2!LAT2_))","v":0.2007081599278136},{"$f":"F31*SIN(RADIANS(90-Sight2!LAT2_))+G31*COS(RADIANS(90-Sight2!LAT2_))","v":0.91173654919484037},null,{"$f":"COS(RADIANS(E31))*COS(RADIANS(Sight2!AZ_nord2-180))","v":0.77149189678753938},null,null,null,null,null,{"$f":"COS(RADIANS(90-Sight2!LON2_+GHAy2))","v":-0.42262105919099158},{"$f":"SIN(RADIANS(90-Sight2!LON2_+GHAy2))","v":0.90630648255889923},null,58,{"$f":"COS(RADIANS(Sight2!DEC2_))*COS(RADIANS(T31))","v":0.49439559978168007},{"$f":"COS(RADIANS(Sight2!DEC2_))*SIN(RADIANS(T31))","v":0.79119834933658273},null,null,null,null,58,{"$f":"COS(RADIANS(Sight2!HC2_))*COS(RADIANS(AA31))","v":0.50322266523643577},{"$f":"COS(RADIANS(Sight2!HC2_))*SIN(RADIANS(AA31))","v":0.8053246069739336},null,{"$f":"IF(AO31=0,RADIANS(90-Sight2!HO2_),IF(AO31=180,-RADIANS(90-Sight2!HO2_),IF(AO31<180,-RADIANS(90-Sight2!HO2_),RADIANS(90-Sight2!HO2_))))","v":-1.251194277580892},1.2578307431703188,-1.2578307431703188,-0.99217484460987859,1.4456134026459997,1.4456134026459997,1.1827853093499152,-2.433979586930807,-1.2253004893004698,-1.9162921642893234,19.268996270213503,46.302929946686383,46.302929946686383,69.680603636578695,69.680603636578695,69.680603636578695,46.32738090001677]
[60,0.50000000000000011,0.8660254037844386,null,30,{"$f":"COS(RADIANS(E32))*COS(RADIANS(Sight2!LHA2_))","v":0.78488443751052506},0.49999999999999994,{"$f":"F32*COS(RADIANS(90-Sight2!LAT2_))-G32*SIN(RADIANS(90-Sight2!LAT2_))","v":0.23302895868535378},{"$f":"F32*SIN(RADIANS(90-Sight2!LAT2_))+G32*COS(RADIANS(90-Sight2!LAT2_))","v":0.90096675003033977},null,{"$f":"COS(RADIANS(E32))*COS(RADIANS(Sight2!AZ_nord2-180))","v":0.78784633142860294},null,null,null,null,null,{"$f":"1.15*COS(RADIANS(90-Sight2!LON2_+GHAy2))","v":-0.48601421806964029},{"$f":"1.15*SIN(RADIANS(90-Sight2!LON2_+GHAy2))","v":1.0422524549427341},null,60,{"$f":"COS(RADIANS(Sight2!DEC2_))*COS(RADIANS(T32))","v":0.46648200315671901},{"$f":"COS(RADIANS(Sight2!DEC2_))*SIN(RADIANS(T32))","v":0.8079705302839425},null,null,null,null,60,{"$f":"COS(RADIANS(Sight2!HC2_))*COS(RADIANS(AA32))","v":0.47481069211986554},{"$f":"COS(RADIANS(Sight2!HC2_))*SIN(RADIANS(AA32))","v":0.82239624272855039},null,{"$f":"IF(AO32=0,RADIANS(90-Sight2!HO2_),IF(AO32=180,-RADIANS(90-Sight2!HO2_),IF(AO32<180,-RADIANS(90-Sight2!HO2_),RADIANS(90-Sight2!HO2_))))","v":-1.251194277580892},1.2545998517380135,-1.2545998517380135,-0.99200039037213505,1.444223833223355,1.444223833223355,1.1823553508120699,-2.4335496283929618,-1.2224037064972071,-1.919188947092586,19.468996270213502,46.217955353497722,46.217955353497722,69.43501374452768,69.43501374452768,69.43501374452768,46.249959505625185]
[62,0.46947156278589086,0.88294759285892688,null,28,{"$f":"COS(RADIANS(E33))*COS(RADIANS(Sight2!LHA2_))","v":0.80022112716782112},0.46947156278589081,{"$f":"F33*COS(RADIANS(90-Sight2!LAT2_))-G33*SIN(RADIANS(90-Sight2!LAT2_))","v":0.26506584755209511},{"$f":"F33*SIN(RADIANS(90-Sight2!LAT2_))+G33*COS(RADIANS(90-Sight2!LAT2_))","v":0.88909926166421616},null,{"$f":"COS(RADIANS(E33))*COS(RADIANS(Sight2!AZ_nord2-180))","v":0.80324089667324472},null,null,null,null,null,null,null,null,62,{"$f":"COS(RADIANS(Sight2!DEC2_))*COS(RADIANS(T33))","v":0.4380000700669554},{"$f":"COS(RADIANS(Sight2!DEC2_))*SIN(RADIANS(T33))","v":0.82375832359847057},null,null,null,null,62,{"$f":"COS(RADIANS(Sight2!HC2_))*COS(RADIANS(AA33))","v":0.44582023531392739},{"$f":"COS(RADIANS(Sight2!HC2_))*SIN(RADIANS(AA33))","v":0.83846591534183246},null,{"$f":"IF(AO33=0,RADIANS(90-Sight2!HO2_),IF(AO33=180,-RADIANS(90-Sight2!HO2_),IF(AO33<180,-RADIANS(90-Sight2!HO2_),RADIANS(90-Sight2!HO2_))))","v":-1.251194277580892},1.2513695321691609,-1.2513695321691609,-0.99182364541714985,1.4428313232213135,1.4428313232213135,1.1819202067700514,-2.4331144843509431,-1.2195255223272479,-1.9220671312625452,19.668996270213501,46.132270787296335,46.132270787296335,69.190320992880913,69.190320992880913,69.190320992880913,46.172820931753932]
[64,0.43837114678907746,0.89879404629916704,null,26,{"$f":"COS(RADIANS(E34))*COS(RADIANS(Sight2!LHA2_))","v":0.81458287064627855},0.4383711467890774,{"$f":"F34*COS(RADIANS(90-Sight2!LAT2_))-G34*SIN(RADIANS(90-Sight2!LAT2_))","v":0.29677979451385811},{"$f":"F34*SIN(RADIANS(90-Sight2!LAT2_))+G34*COS(RADIANS(90-Sight2!LAT2_))","v":0.8761485428029967},null,{"$f":"COS(RADIANS(E34))*COS(RADIANS(Sight2!AZ_nord2-180))","v":0.81765683661506516},null,null,null,null,null,"Horizontal axis",null,null,64,{"$f":"COS(RADIANS(Sight2!DEC2_))*COS(RADIANS(T34))","v":0.40898450136055381},{"$f":"COS(RADIANS(Sight2!DEC2_))*SIN(RADIANS(T34))","v":0.83854249428593641},null,null,null,null,64,{"$f":"COS(RADIANS(Sight2!HC2_))*COS(RADIANS(AA34))","v":0.41628661522460197},{"$f":"COS(RADIANS(Sight2!HC2_))*SIN(RADIANS(AA34))","v":0.85351404639304373},null,{"$f":"IF(AO34=0,RADIANS(90-Sight2!HO2_),IF(AO34=180,-RADIANS(90-Sight2!HO2_),IF(AO34<180,-RADIANS(90-Sight2!HO2_),RADIANS(90-Sight2!HO2_))))","v":-1.251194277580892},1.2481397919510335,-1.2481397919510335,-0.99164459300458507,1.4414358346703631,1.4414358346703631,1.1814798524978516,-2.4326741300787438,-1.2166660118984038,-1.9249266416913893,19.868996270213501,46.045880409358695,46.045880409358695,68.94652750950624,68.94652750950624,68.94652750950624,46.09596584920628]
[66,0.40673664307580021,0.91354545764260087,null,24,{"$f":"COS(RADIANS(E35))*COS(RADIANS(Sight2!LHA2_))","v":0.82795217037372548},0.40673664307580021,{"$f":"F35*COS(RADIANS(90-Sight2!LAT2_))-G35*SIN(RADIANS(90-Sight2!LAT2_))","v":0.32813216101142867},{"$f":"F35*SIN(RADIANS(90-Sight2!LAT2_))+G35*COS(RADIANS(90-Sight2!LAT2_))","v":0.86213037190270891},null,{"$f":"COS(RADIANS(E35))*COS(RADIANS(Sight2!AZ_nord2-180))","v":0.83107658765185044},null,null,null,null,null,-1.3,0,null,{"$f":"SUM(T34+2)","v":66},{"$f":"COS(RADIANS(Sight2!DEC2_))*COS(RADIANS(T35))","v":0.37947064803847735},{"$f":"COS(RADIANS(Sight2!DEC2_))*SIN(RADIANS(T35))","v":0.8523050301116839},null,null,null,null,66,{"$f":"COS(RADIANS(Sight2!HC2_))*COS(RADIANS(AA35))","v":0.38624581401866276},{"$f":"COS(RADIANS(Sight2!HC2_))*SIN(RADIANS(AA35))","v":0.86752230205248504},null,{"$f":"IF(AO35=0,RADIANS(90-Sight2!HO2_),IF(AO35=180,-RADIANS(90-Sight2!HO2_),IF(AO35<180,-RADIANS(90-Sight2!HO2_),RADIANS(90-Sight2!HO2_))))","v":-1.251194277580892},1.2449106386258477,-1.2449106386258477,-0.99146321613177435,1.4400373293393087,1.4400373293393087,1.1810342629230486,-2.4322285405039406,-1.2138252482642304,-1.9277674053255627,20.0689962702135,45.958788382475625,45.958788382475625,68.703635289577889,68.703635289577889,68.703635289577889,46.019394886954238]
[68,0.37460659341591196,0.92718385456678742,null,22,{"$f":"COS(RADIANS(E36))*COS(RADIANS(Sight2!LHA2_))","v":0.84031273791782712},0.37460659341591201,{"$f":"F36*COS(RADIANS(90-Sight2!LAT2_))-G36*SIN(RADIANS(90-Sight2!LAT2_))","v":0.3590847490156916},{"$f":"F36*SIN(RADIANS(90-Sight2!LAT2_))+G36*COS(RADIANS(90-Sight2!LAT2_))","v":0.84706182794526108},null,{"$f":"COS(RADIANS(E36))*COS(RADIANS(Sight2!AZ_nord2-180))","v":0.84348379988411659},null,null,null,null,null,1.3,0,null,68,{"$f":"COS(RADIANS(Sight2!DEC2_))*COS(RADIANS(T36))","v":0.34949446818473828},{"$f":"COS(RADIANS(Sight2!DEC2_))*SIN(RADIANS(T36))","v":0.86502916354576587},null,null,null,null,68,{"$f":"COS(RADIANS(Sight2!HC2_))*COS(RADIANS(AA36))","v":0.35573443178494835},{"$f":"COS(RADIANS(Sight2!HC2_))*SIN(RADIANS(AA36))","v":0.88047361541844193},null,{"$f":"IF(AO36=0,RADIANS(90-Sight2!HO2_),IF(AO36=180,-RADIANS(90-Sight2!HO2_),IF(AO36<180,-RADIANS(90-Sight2!HO2_),RADIANS(90-Sight2!HO2_))))","v":-1.251194277580892},1.2416820797916228,-1.2416820797916228,-0.99127949753045519,1.4386357687313216,1.4386357687313216,1.1805834126235921,-2.4317776902044841,-1.2110033024557438,-1.9305893511340493,20.268996270213499,45.870998870273837,45.870998870273837,68.461646197167525,68.461646197167525,68.461646197167525,45.943108632640183]
[70,0.34202014332566882,0.93969262078590832,null,20,{"$f":"COS(RADIANS(E37))*COS(RADIANS(Sight2!LHA2_))","v":0.85164951383103027},0.34202014332566871,{"$f":"F37*COS(RADIANS(90-Sight2!LAT2_))-G37*SIN(RADIANS(90-Sight2!LAT2_))","v":0.38959984756604416},{"$f":"F37*SIN(RADIANS(90-Sight2!LAT2_))+G37*COS(RADIANS(90-Sight2!LAT2_))","v":0.8309612696303339},null,{"$f":"COS(RADIANS(E37))*COS(RADIANS(Sight2!AZ_nord2-180))","v":0.85486335703494298},null,null,null,null,null,null,null,null,70,{"$f":"COS(RADIANS(Sight2!DEC2_))*COS(RADIANS(T37))","v":0.31909248315701216},{"$f":"COS(RADIANS(Sight2!DEC2_))*SIN(RADIANS(T37))","v":0.87669939219159509},null,null,null,null,70,{"$f":"COS(RADIANS(Sight2!HC2_))*COS(RADIANS(AA37))","v":0.32478964194279275},{"$f":"COS(RADIANS(Sight2!HC2_))*SIN(RADIANS(AA37))","v":0.89235220731057474},null,{"$f":"IF(AO37=0,RADIANS(90-Sight2!HO2_),IF(AO37=180,-RADIANS(90-Sight2!HO2_),IF(AO37<180,-RADIANS(90-Sight2!HO2_),RADIANS(90-Sight2!HO2_))))","v":-1.251194277580892},1.2384541231030526,-1.2384541231030526,-0.99109341966344267,1.4372311140799625,1.4372311140799625,1.1801272758245436,-2.4313215534054358,-1.2082002435135213,-1.9333924100762718,20.468996270213498,45.782516036549026,45.782516036549026,68.22056196685547,68.22056196685547,68.22056196685547,45.867107633084771]
[72,0.30901699437494745,0.95105651629515353,null,18,{"$f":"COS(RADIANS(E38))*COS(RADIANS(Sight2!LHA2_))","v":0.86194868599818097},0.3090169943749474,{"$f":"F38*COS(RADIANS(90-Sight2!LAT2_))-G38*SIN(RADIANS(90-Sight2!LAT2_))","v":0.41964027871539333},{"$f":"F38*SIN(RADIANS(90-Sight2!LAT2_))+G38*COS(RADIANS(90-Sight2!LAT2_))","v":0.81384831300813298},null,{"$f":"COS(RADIANS(E38))*COS(RADIANS(Sight2!AZ_nord2-180))","v":0.86520139486682768},null,null,null,null,null,"Hour marks",null,null,72,{"$f":"COS(RADIANS(Sight2!DEC2_))*COS(RADIANS(T38))","v":0.28830173309098805},{"$f":"COS(RADIANS(Sight2!DEC2_))*SIN(RADIANS(T38))","v":0.88730149767322775},null,null,null,null,72,{"$f":"COS(RADIANS(Sight2!HC2_))*COS(RADIANS(AA38))","v":0.29344914595193872},{"$f":"COS(RADIANS(Sight2!HC2_))*SIN(RADIANS(AA38))","v":0.90314360549441985},null,{"$f":"IF(AO38=0,RADIANS(90-Sight2!HO2_),IF(AO38=180,-RADIANS(90-Sight2!HO2_),IF(AO38<180,-RADIANS(90-Sight2!HO2_),RADIANS(90-Sight2!HO2_))))","v":-1.251194277580892},1.2352267762723859,-1.2352267762723859,-0.99090496472124057,1.4358233263451425,1.4358233263451425,1.1796658263947575,-2.4308601039756494,-1.2054161385202078,-1.9361765150695853,20.668996270213498,45.693344044610697,45.693344044610697,67.980384205361844,67.980384205361844,67.980384205361844,45.791392394801164]
[74,0.27563735581699916,0.96126169593831889,null,16,{"$f":"COS(RADIANS(E39))*COS(RADIANS(Sight2!LHA2_))","v":0.87119770646445993},0.27563735581699916,{"$f":"F39*COS(RADIANS(90-Sight2!LAT2_))-G39*SIN(RADIANS(90-Sight2!LAT2_))","v":0.44916944282575749},{"$f":"F39*SIN(RADIANS(90-Sight2!LAT2_))+G39*COS(RADIANS(90-Sight2!LAT2_))","v":0.79574380758025431},null,{"$f":"COS(RADIANS(E39))*COS(RADIANS(Sight2!AZ_nord2-180))","v":0.87448531807312535},null,0,{"$f":"COS(RADIANS(90+M39))","v":6.1257422745431001E-17},{"$f":"SIN(RADIANS(90+M39))","v":1},0,{"$f":"COS(RADIANS(90+P39))","v":6.1257422745431001E-17},{"$f":"SIN(RADIANS(90+P39))","v":1},null,74,{"$f":"COS(RADIANS(Sight2!DEC2_))*COS(RADIANS(T39))","v":0.2571597317726701},{"$f":"COS(RADIANS(Sight2!DEC2_))*SIN(RADIANS(T39))","v":0.89682256295826368},null,null,null,null,74,{"$f":"COS(RADIANS(Sight2!HC2_))*COS(RADIANS(AA39))","v":0.26175112737911799},{"$f":"COS(RADIANS(Sight2!HC2_))*SIN(RADIANS(AA39))","v":0.91283466231357768}]
[76,0.24192189559966767,0.97029572627599647,null,14,{"$f":"COS(RADIANS(E40))*COS(RADIANS(Sight2!LHA2_))","v":0.87938530672313087},0.24192189559966773,{"$f":"F40*COS(RADIANS(90-Sight2!LAT2_))-G40*SIN(RADIANS(90-Sight2!LAT2_))","v":0.47815136315928697},{"$f":"F40*SIN(RADIANS(90-Sight2!LAT2_))+G40*COS(RADIANS(90-Sight2!LAT2_))","v":0.77666981089777598},null,{"$f":"COS(RADIANS(E40))*COS(RADIANS(Sight2!AZ_nord2-180))","v":0.88270381562348776},null,{"$f":"SUM(M39+5)","v":5},{"$f":"COS(RADIANS(90+M40))","v":-8.7155742747658235E-2},{"$f":"SIN(RADIANS(90+M40))","v":0.99619469809174555},{"$f":"SUM(P39+15)","v":15},{"$f":"COS(RADIANS(90+P40))","v":-0.25881904510252085},{"$f":"SIN(RADIANS(90+P40))","v":0.96592582628906831},null,76,{"$f":"COS(RADIANS(Sight2!DEC2_))*COS(RADIANS(T40))","v":0.22570442093360718},{"$f":"COS(RADIANS(Sight2!DEC2_))*SIN(RADIANS(T40))","v":0.9052509880952605},null,null,null,null,76,{"$f":"COS(RADIANS(Sight2!HC2_))*COS(RADIANS(AA40))","v":0.22973420537725608},{"$f":"COS(RADIANS(Sight2!HC2_))*SIN(RADIANS(AA40))","v":0.92141357070810681}]
[78,0.20791169081775945,0.97814760073380558,null,12,{"$f":"COS(RADIANS(E41))*COS(RADIANS(Sight2!LHA2_))","v":0.88650151144448197},0.20791169081775934,{"$f":"F41*COS(RADIANS(90-Sight2!LAT2_))-G41*SIN(RADIANS(90-Sight2!LAT2_))","v":0.50655072971037818},{"$f":"F41*SIN(RADIANS(90-Sight2!LAT2_))+G41*COS(RADIANS(90-Sight2!LAT2_))","v":0.75664956168753172},null,{"$f":"COS(RADIANS(E41))*COS(RADIANS(Sight2!AZ_nord2-180))","v":0.88984687454461231},null,{"$f":"SUM(M40+5)","v":10},-0.1736481776669303,0.98480775301220802,{"$f":"SUM(P40+15)","v":30},-0.49999999999999978,0.86602540378443871,null,78,{"$f":"COS(RADIANS(Sight2!DEC2_))*COS(RADIANS(T41))","v":0.19397412402473765},{"$f":"COS(RADIANS(Sight2!DEC2_))*SIN(RADIANS(T41))","v":0.91257650434648818},null,null,null,null,78,{"$f":"COS(RADIANS(Sight2!HC2_))*COS(RADIANS(AA41))","v":0.19743738763398366},{"$f":"COS(RADIANS(Sight2!HC2_))*SIN(RADIANS(AA41))","v":0.92886987859960801}]
[80,0.17364817766693041,0.98480775301220802,null,10,{"$f":"COS(RADIANS(E42))*COS(RADIANS(Sight2!LHA2_))","v":0.89253765062922741},0.17364817766693033,{"$f":"F42*COS(RADIANS(90-Sight2!LAT2_))-G42*SIN(RADIANS(90-Sight2!LAT2_))","v":0.53433294222547545},{"$f":"F42*SIN(RADIANS(90-Sight2!LAT2_))+G42*COS(RADIANS(90-Sight2!LAT2_))","v":0.73570745153930117},null,{"$f":"COS(RADIANS(E42))*COS(RADIANS(Sight2!AZ_nord2-180))","v":0.89590579211950738},null,15,-0.25881904510252085,0.96592582628906831,45,-0.70710678118654746,0.70710678118654757,null,80,{"$f":"COS(RADIANS(Sight2!DEC2_))*COS(RADIANS(T42))","v":0.16200749952516702},{"$f":"COS(RADIANS(Sight2!DEC2_))*SIN(RADIANS(T42))","v":0.91879018669880408},null,null,null,null,80,{"$f":"COS(RADIANS(Sight2!HC2_))*COS(RADIANS(AA42))","v":0.16490002284677718},{"$f":"COS(RADIANS(Sight2!HC2_))*SIN(RADIANS(AA42))","v":0.93519450162547191}]
[82,0.13917310096006547,0.99026806874157036,null,8,{"$f":"COS(RADIANS(E43))*COS(RADIANS(Sight2!LHA2_))","v":0.89748637017156685},0.13917310096006544,{"$f":"F43*COS(RADIANS(90-Sight2!LAT2_))-G43*SIN(RADIANS(90-Sight2!LAT2_))","v":0.56146415235815128},{"$f":"F43*SIN(RADIANS(90-Sight2!LAT2_))+G43*COS(RADIANS(90-Sight2!LAT2_))","v":0.71386899518841551},null,{"$f":"COS(RADIANS(E43))*COS(RADIANS(Sight2!AZ_nord2-180))","v":0.90087318649041292},null,20,-0.34202014332566871,0.93969262078590843,60,-0.86602540378443871,0.49999999999999994,null,82,{"$f":"COS(RADIANS(Sight2!DEC2_))*COS(RADIANS(T43))","v":0.12984349384276722},{"$f":"COS(RADIANS(Sight2!DEC2_))*SIN(RADIANS(T43))","v":0.92388446473740626},null,null,null,null,82,{"$f":"COS(RADIANS(Sight2!HC2_))*COS(RADIANS(AA43))","v":0.13216175278263317},{"$f":"COS(RADIANS(Sight2!HC2_))*SIN(RADIANS(AA43))","v":0.94037973420677501}]
[84,0.10452846326765346,0.99452189536827329,null,6,{"$f":"COS(RADIANS(E44))*COS(RADIANS(Sight2!LHA2_))","v":0.90134164081902934},0.10452846326765347,{"$f":"F44*COS(RADIANS(90-Sight2!LAT2_))-G44*SIN(RADIANS(90-Sight2!LAT2_))","v":0.58791130490810117},{"$f":"F44*SIN(RADIANS(90-Sight2!LAT2_))+G44*COS(RADIANS(90-Sight2!LAT2_))","v":0.69116079942998132},null,{"$f":"COS(RADIANS(E44))*COS(RADIANS(Sight2!AZ_nord2-180))","v":0.90474300565245613},null,25,-0.42261826174069933,0.90630778703665005,75,-0.9659258262890682,0.25881904510252102,null,84,{"$f":"COS(RADIANS(Sight2!DEC2_))*COS(RADIANS(T44))","v":9.7521293863976996E-2},{"$f":"COS(RADIANS(Sight2!DEC2_))*SIN(RADIANS(T44))","v":0.92785313186921781},null,null,null,null,84,{"$f":"COS(RADIANS(Sight2!HC2_))*COS(RADIANS(AA44))","v":9.9262463980680934E-2},{"$f":"COS(RADIANS(Sight2!HC2_))*SIN(RADIANS(AA44))","v":0.94441925893634049}]
[86,6.9756473744125233E-2,0.9975640502598242,null,4,{"$f":"COS(RADIANS(E45))*COS(RADIANS(Sight2!LHA2_))","v":0.90409876551819024},6.9756473744125302E-2,{"$f":"F45*COS(RADIANS(90-Sight2!LAT2_))-G45*SIN(RADIANS(90-Sight2!LAT2_))","v":0.61364217809381472},{"$f":"F45*SIN(RADIANS(90-Sight2!LAT2_))+G45*COS(RADIANS(90-Sight2!LAT2_))","v":0.66761053070260157},null,{"$f":"COS(RADIANS(E45))*COS(RADIANS(Sight2!AZ_nord2-180))","v":0.90751053482708821},null,30,-0.49999999999999978,0.86602540378443871,90,-1,1.22514845490862E-16,null,86,{"$f":"COS(RADIANS(Sight2!DEC2_))*COS(RADIANS(T45))","v":6.5080279210617209E-2},{"$f":"COS(RADIANS(Sight2!DEC2_))*SIN(RADIANS(T45))","v":0.9306913528846652},null,null,null,null,86,{"$f":"COS(RADIANS(Sight2!HC2_))*COS(RADIANS(AA45))","v":6.6242239156578647E-2},{"$f":"COS(RADIANS(Sight2!HC2_))*SIN(RADIANS(AA45))","v":0.94730815427552673}]
[88,3.489949670250108E-2,0.99939082701909576,null,2,{"$f":"COS(RADIANS(E46))*COS(RADIANS(Sight2!LHA2_))","v":0.905754385137306},3.4899496702500969E-2,{"$f":"F46*COS(RADIANS(90-Sight2!LAT2_))-G46*SIN(RADIANS(90-Sight2!LAT2_))","v":0.63862542280985224},{"$f":"F46*SIN(RADIANS(90-Sight2!LAT2_))+G46*COS(RADIANS(90-Sight2!LAT2_))","v":0.64324688138107944},null,{"$f":"COS(RADIANS(E46))*COS(RADIANS(Sight2!AZ_nord2-180))","v":0.90917240220631501},null,35,-0.57357643635104616,0.81915204428899169,105,-0.96592582628906831,-0.25881904510252079,null,88,{"$f":"COS(RADIANS(Sight2!DEC2_))*COS(RADIANS(T46))","v":3.2559974261888017E-2},{"$f":"COS(RADIANS(Sight2!DEC2_))*SIN(RADIANS(T46))","v":0.93239566984863542},null,null,null,null,88,{"$f":"COS(RADIANS(Sight2!HC2_))*COS(RADIANS(AA46))","v":3.3141308367898997E-2},{"$f":"COS(RADIANS(Sight2!HC2_))*SIN(RADIANS(AA46))","v":0.94904290055036311}]
[90,6.1257422745431001E-17,1,null,0,{"$f":"COS(RADIANS(E47))*COS(RADIANS(Sight2!LHA2_))","v":0.90630648255889923},0,{"$f":"F47*COS(RADIANS(90-Sight2!LAT2_))-G47*SIN(RADIANS(90-Sight2!LAT2_))","v":0.66283060082090106},{"$f":"F47*SIN(RADIANS(90-Sight2!LAT2_))+G47*COS(RADIANS(90-Sight2!LAT2_))","v":0.61809953481918067},null,{"$f":"COS(RADIANS(E47))*COS(RADIANS(Sight2!AZ_nord2-180))","v":0.90972658306072596},null,40,-0.64278760968653936,0.76604444311897801,120,-0.8660254037844386,-0.50000000000000011,null,90,{"$f":"COS(RADIANS(Sight2!DEC2_))*COS(RADIANS(T47))","v":5.7150970541013221E-17},{"$f":"COS(RADIANS(Sight2!DEC2_))*SIN(RADIANS(T47))","v":0.93296400631343779},null,null,null,null,90,{"$f":"COS(RADIANS(Sight2!HC2_))*COS(RADIANS(AA47))","v":5.8171358582474558E-17},{"$f":"COS(RADIANS(Sight2!HC2_))*SIN(RADIANS(AA47))","v":0.94962138423973086}]
[92,-3.4899496702500955E-2,0.99939082701909576,null,-2,{"$f":"COS(RADIANS(E48))*COS(RADIANS(Sight2!LHA2_))","v":0.905754385137306},-3.4899496702500969E-2,{"$f":"F48*COS(RADIANS(90-Sight2!LAT2_))-G48*SIN(RADIANS(90-Sight2!LAT2_))","v":0.68622822184607668},{"$f":"F48*SIN(RADIANS(90-Sight2!LAT2_))+G48*COS(RADIANS(90-Sight2!LAT2_))","v":0.59219912918503925},null,{"$f":"COS(RADIANS(E48))*COS(RADIANS(Sight2!AZ_nord2-180))","v":0.90917240220631501},null,45,-0.70710678118654746,0.70710678118654757,135,-0.70710678118654768,-0.70710678118654746,null,92,{"$f":"COS(RADIANS(Sight2!DEC2_))*COS(RADIANS(T48))","v":-3.2559974261887906E-2},{"$f":"COS(RADIANS(Sight2!DEC2_))*SIN(RADIANS(T48))","v":0.93239566984863542},null,null,null,null,92,{"$f":"COS(RADIANS(Sight2!HC2_))*COS(RADIANS(AA48))","v":-3.3141308367898879E-2},{"$f":"COS(RADIANS(Sight2!HC2_))*SIN(RADIANS(AA48))","v":0.94904290055036311}]
[94,-6.975647374412533E-2,0.9975640502598242,null,-4,{"$f":"COS(RADIANS(E49))*COS(RADIANS(Sight2!LHA2_))","v":0.90409876551819024},-6.9756473744125302E-2,{"$f":"F49*COS(RADIANS(90-Sight2!LAT2_))-G49*SIN(RADIANS(90-Sight2!LAT2_))","v":0.70878977948828703},{"$f":"F49*SIN(RADIANS(90-Sight2!LAT2_))+G49*COS(RADIANS(90-Sight2!LAT2_))","v":0.56557722013326861},null,{"$f":"COS(RADIANS(E49))*COS(RADIANS(Sight2!AZ_nord2-180))","v":0.90751053482708821},null,50,-0.7660444431189779,0.64278760968653947,150,-0.50000000000000044,-0.86602540378443837,null,94,{"$f":"COS(RADIANS(Sight2!DEC2_))*COS(RADIANS(T49))","v":-6.5080279210617306E-2},{"$f":"COS(RADIANS(Sight2!DEC2_))*SIN(RADIANS(T49))","v":0.9306913528846652},null,null,null,null,94,{"$f":"COS(RADIANS(Sight2!HC2_))*COS(RADIANS(AA49))","v":-6.6242239156578731E-2},{"$f":"COS(RADIANS(Sight2!HC2_))*SIN(RADIANS(AA49))","v":0.94730815427552673}]
[96,-0.10452846326765355,0.99452189536827329,null,-6,{"$f":"COS(RADIANS(E50))*COS(RADIANS(Sight2!LHA2_))","v":0.90134164081902934},-0.10452846326765347,{"$f":"F50*COS(RADIANS(90-Sight2!LAT2_))-G50*SIN(RADIANS(90-Sight2!LAT2_))","v":0.73048778596488673},{"$f":"F50*SIN(RADIANS(90-Sight2!LAT2_))+G50*COS(RADIANS(90-Sight2!LAT2_))","v":0.53826624235925769},null,{"$f":"COS(RADIANS(E50))*COS(RADIANS(Sight2!AZ_nord2-180))","v":0.90474300565245613},null,55,-0.81915204428899191,0.57357643635104594,165,-0.25881904510252063,-0.96592582628906831,null,96,{"$f":"COS(RADIANS(Sight2!DEC2_))*COS(RADIANS(T50))","v":-9.7521293863977079E-2},{"$f":"COS(RADIANS(Sight2!DEC2_))*SIN(RADIANS(T50))","v":0.92785313186921781},null,null,null,null,96,{"$f":"COS(RADIANS(Sight2!HC2_))*COS(RADIANS(AA50))","v":-9.9262463980681032E-2},{"$f":"COS(RADIANS(Sight2!HC2_))*SIN(RADIANS(AA50))","v":0.94441925893634049}]
[98,-0.13917310096006535,0.99026806874157036,null,-8,{"$f":"COS(RADIANS(E51))*COS(RADIANS(Sight2!LHA2_))","v":0.89748637017156685},-0.13917310096006544,{"$f":"F51*COS(RADIANS(90-Sight2!LAT2_))-G51*SIN(RADIANS(90-Sight2!LAT2_))","v":0.75129580559730569},{"$f":"F51*SIN(RADIANS(90-Sight2!LAT2_))+G51*COS(RADIANS(90-Sight2!LAT2_))","v":0.51029947008249066},null,{"$f":"COS(RADIANS(E51))*COS(RADIANS(Sight2!AZ_nord2-180))","v":0.90087318649041292},null,60,-0.86602540378443871,0.49999999999999994,180,-1.83772268236293E-16,-1,null,98,{"$f":"COS(RADIANS(Sight2!DEC2_))*COS(RADIANS(T51))","v":-0.12984349384276714},{"$f":"COS(RADIANS(Sight2!DEC2_))*SIN(RADIANS(T51))","v":0.92388446473740626},null,null,null,null,98,{"$f":"COS(RADIANS(Sight2!HC2_))*COS(RADIANS(AA51))","v":-0.13216175278263309},{"$f":"COS(RADIANS(Sight2!HC2_))*SIN(RADIANS(AA51))","v":0.94037973420677501}]
[100,-0.1736481776669303,0.98480775301220802,null,-10,{"$f":"COS(RADIANS(E52))*COS(RADIANS(Sight2!LHA2_))","v":0.89253765062922741},-0.17364817766693033,{"$f":"F52*COS(RADIANS(90-Sight2!LAT2_))-G52*SIN(RADIANS(90-Sight2!LAT2_))","v":0.77118848701885123},{"$f":"F52*SIN(RADIANS(90-Sight2!LAT2_))+G52*COS(RADIANS(90-Sight2!LAT2_))","v":0.48171097650703548},null,{"$f":"COS(RADIANS(E52))*COS(RADIANS(Sight2!AZ_nord2-180))","v":0.89590579211950738},null,65,-0.90630778703664994,0.4226182617406995,195,0.2588190451025203,-0.96592582628906842,null,100,{"$f":"COS(RADIANS(Sight2!DEC2_))*COS(RADIANS(T52))","v":-0.16200749952516694},{"$f":"COS(RADIANS(Sight2!DEC2_))*SIN(RADIANS(T52))","v":0.91879018669880408},null,null,null,null,100,{"$f":"COS(RADIANS(Sight2!HC2_))*COS(RADIANS(AA52))","v":-0.16490002284677707},{"$f":"COS(RADIANS(Sight2!HC2_))*SIN(RADIANS(AA52))","v":0.93519450162547191}]
[102,-0.20791169081775934,0.97814760073380569,null,-12,{"$f":"COS(RADIANS(E53))*COS(RADIANS(Sight2!LHA2_))","v":0.88650151144448197},-0.20791169081775934,{"$f":"F53*COS(RADIANS(90-Sight2!LAT2_))-G53*SIN(RADIANS(90-Sight2!LAT2_))","v":0.79014159406144446},{"$f":"F53*SIN(RADIANS(90-Sight2!LAT2_))+G53*COS(RADIANS(90-Sight2!LAT2_))","v":0.45253559230859408},null,{"$f":"COS(RADIANS(E53))*COS(RADIANS(Sight2!AZ_nord2-180))","v":0.88984687454461231},null,70,-0.93969262078590832,0.34202014332566888,210,0.50000000000000011,-0.8660254037844386,null,102,{"$f":"COS(RADIANS(Sight2!DEC2_))*COS(RADIANS(T53))","v":-0.19397412402473754},{"$f":"COS(RADIANS(Sight2!DEC2_))*SIN(RADIANS(T53))","v":0.91257650434648829},null,null,null,null,102,{"$f":"COS(RADIANS(Sight2!HC2_))*COS(RADIANS(AA53))","v":-0.19743738763398358},{"$f":"COS(RADIANS(Sight2!HC2_))*SIN(RADIANS(AA53))","v":0.92886987859960812}]
[104,-0.24192189559966779,0.97029572627599647,null,-14,{"$f":"COS(RADIANS(E54))*COS(RADIANS(Sight2!LHA2_))","v":0.87938530672313087},-0.24192189559966773,{"$f":"F54*COS(RADIANS(90-Sight2!LAT2_))-G54*SIN(RADIANS(90-Sight2!LAT2_))","v":0.80813203528365574},{"$f":"F54*SIN(RADIANS(90-Sight2!LAT2_))+G54*COS(RADIANS(90-Sight2!LAT2_))","v":0.42280886319868893},null,{"$f":"COS(RADIANS(E54))*COS(RADIANS(Sight2!AZ_nord2-180))","v":0.88270381562348776},null,75,-0.9659258262890682,0.25881904510252102,225,0.70710678118654735,-0.70710678118654768,null,104,{"$f":"COS(RADIANS(Sight2!DEC2_))*COS(RADIANS(T54))","v":-0.22570442093360729},{"$f":"COS(RADIANS(Sight2!DEC2_))*SIN(RADIANS(T54))","v":0.9052509880952605},null,null,null,null,104,{"$f":"COS(RADIANS(Sight2!HC2_))*COS(RADIANS(AA54))","v":-0.22973420537725617},{"$f":"COS(RADIANS(Sight2!HC2_))*SIN(RADIANS(AA54))","v":0.92141357070810681}]
[106,-0.27563735581699905,0.96126169593831889,null,-16,{"$f":"COS(RADIANS(E55))*COS(RADIANS(Sight2!LHA2_))","v":0.87119770646445993},-0.27563735581699916,{"$f":"F55*COS(RADIANS(90-Sight2!LAT2_))-G55*SIN(RADIANS(90-Sight2!LAT2_))","v":0.82513789210407107},{"$f":"F55*SIN(RADIANS(90-Sight2!LAT2_))+G55*COS(RADIANS(90-Sight2!LAT2_))","v":0.3925670066176889},null,{"$f":"COS(RADIANS(E55))*COS(RADIANS(Sight2!AZ_nord2-180))","v":0.87448531807312535},null,80,-0.98480775301220802,0.17364817766693028,240,0.86602540378443837,-0.50000000000000044,null,106,{"$f":"COS(RADIANS(Sight2!DEC2_))*COS(RADIANS(T55))","v":-0.25715973177266999},{"$f":"COS(RADIANS(Sight2!DEC2_))*SIN(RADIANS(T55))","v":0.89682256295826368},null,null,null,null,106,{"$f":"COS(RADIANS(Sight2!HC2_))*COS(RADIANS(AA55))","v":-0.26175112737911788},{"$f":"COS(RADIANS(Sight2!HC2_))*SIN(RADIANS(AA55))","v":0.91283466231357768}]
[108,-0.30901699437494734,0.95105651629515364,null,-18,{"$f":"COS(RADIANS(E56))*COS(RADIANS(Sight2!LHA2_))","v":0.86194868599818097},-0.3090169943749474,{"$f":"F56*COS(RADIANS(90-Sight2!LAT2_))-G56*SIN(RADIANS(90-Sight2!LAT2_))","v":0.84113844550570616},{"$f":"F56*SIN(RADIANS(90-Sight2!LAT2_))+G56*COS(RADIANS(90-Sight2!LAT2_))","v":0.36184686760943674},null,{"$f":"COS(RADIANS(E56))*COS(RADIANS(Sight2!AZ_nord2-180))","v":0.86520139486682768},null,85,-0.99619469809174555,8.7155742747658194E-2,255,0.96592582628906831,-0.25881904510252068,null,108,{"$f":"COS(RADIANS(Sight2!DEC2_))*COS(RADIANS(T56))","v":-0.28830173309098794},{"$f":"COS(RADIANS(Sight2!DEC2_))*SIN(RADIANS(T56))","v":0.88730149767322786},null,null,null,null,108,{"$f":"COS(RADIANS(Sight2!HC2_))*COS(RADIANS(AA56))","v":-0.29344914595193861},{"$f":"COS(RADIANS(Sight2!HC2_))*SIN(RADIANS(AA56))","v":0.90314360549441997}]
[110,-0.34202014332566871,0.93969262078590843,null,-20,{"$f":"COS(RADIANS(E57))*COS(RADIANS(Sight2!LHA2_))","v":0.85164951383103027},-0.34202014332566871,{"$f":"F57*COS(RADIANS(90-Sight2!LAT2_))-G57*SIN(RADIANS(90-Sight2!LAT2_))","v":0.85611420127893767},{"$f":"F57*SIN(RADIANS(90-Sight2!LAT2_))+G57*COS(RADIANS(90-Sight2!LAT2_))","v":0.33068587393123977},null,{"$f":"COS(RADIANS(E57))*COS(RADIANS(Sight2!AZ_nord2-180))","v":0.85486335703494298},null,90,-1,1.22514845490862E-16,270,1,-2.45029690981724E-16,null,110,{"$f":"COS(RADIANS(Sight2!DEC2_))*COS(RADIANS(T57))","v":-0.31909248315701211},{"$f":"COS(RADIANS(Sight2!DEC2_))*SIN(RADIANS(T57))","v":0.87669939219159521},null,null,null,null,110,{"$f":"COS(RADIANS(Sight2!HC2_))*COS(RADIANS(AA57))","v":-0.3247896419427927},{"$f":"COS(RADIANS(Sight2!HC2_))*SIN(RADIANS(AA57))","v":0.89235220731057485}]
[112,-0.37460659341591207,0.92718385456678742,null,-22,{"$f":"COS(RADIANS(E58))*COS(RADIANS(Sight2!LHA2_))","v":0.84031273791782712},-0.37460659341591201,{"$f":"F58*COS(RADIANS(90-Sight2!LAT2_))-G58*SIN(RADIANS(90-Sight2!LAT2_))","v":0.87004691377219379},{"$f":"F58*SIN(RADIANS(90-Sight2!LAT2_))+G58*COS(RADIANS(90-Sight2!LAT2_))","v":0.29912199045391136},null,{"$f":"COS(RADIANS(E58))*COS(RADIANS(Sight2!AZ_nord2-180))","v":0.84348379988411659},null,95,-0.99619469809174555,-8.7155742747657944E-2,285,0.96592582628906842,0.25881904510252024,null,112,{"$f":"COS(RADIANS(Sight2!DEC2_))*COS(RADIANS(T58))","v":-0.34949446818473839},{"$f":"COS(RADIANS(Sight2!DEC2_))*SIN(RADIANS(T58))","v":0.86502916354576587},null,null,null,null,112,{"$f":"COS(RADIANS(Sight2!HC2_))*COS(RADIANS(AA58))","v":-0.35573443178494846},{"$f":"COS(RADIANS(Sight2!HC2_))*SIN(RADIANS(AA58))","v":0.88047361541844193}]
[114,-0.40673664307580026,0.91354545764260087,null,-24,{"$f":"COS(RADIANS(E59))*COS(RADIANS(Sight2!LHA2_))","v":0.82795217037372548},-0.40673664307580021,{"$f":"F59*COS(RADIANS(90-Sight2!LAT2_))-G59*SIN(RADIANS(90-Sight2!LAT2_))","v":0.88291960812147163},{"$f":"F59*SIN(RADIANS(90-Sight2!LAT2_))+G59*COS(RADIANS(90-Sight2!LAT2_))","v":0.26719367290742529},null,{"$f":"COS(RADIANS(E59))*COS(RADIANS(Sight2!AZ_nord2-180))","v":0.83107658765185044},null,100,-0.98480775301220802,-0.17364817766693047,300,0.8660254037844386,0.5,null,114,{"$f":"COS(RADIANS(Sight2!DEC2_))*COS(RADIANS(T59))","v":-0.37947064803847741},{"$f":"COS(RADIANS(Sight2!DEC2_))*SIN(RADIANS(T59))","v":0.8523050301116839},null,null,null,null,114,{"$f":"COS(RADIANS(Sight2!HC2_))*COS(RADIANS(AA59))","v":-0.38624581401866281},{"$f":"COS(RADIANS(Sight2!HC2_))*SIN(RADIANS(AA59))","v":0.86752230205248504}]
[116,-0.43837114678907751,0.89879404629916693,null,-26,{"$f":"COS(RADIANS(E60))*COS(RADIANS(Sight2!LHA2_))","v":0.81458287064627855},-0.4383711467890774,{"$f":"F60*COS(RADIANS(90-Sight2!LAT2_))-G60*SIN(RADIANS(90-Sight2!LAT2_))","v":0.89471660093159322},{"$f":"F60*SIN(RADIANS(90-Sight2!LAT2_))+G60*COS(RADIANS(90-Sight2!LAT2_))","v":0.23493982102853178},null,{"$f":"COS(RADIANS(E60))*COS(RADIANS(Sight2!AZ_nord2-180))","v":0.81765683661506516},null,105,-0.96592582628906831,-0.25881904510252079,315,0.70710678118654768,0.70710678118654735,null,116,{"$f":"COS(RADIANS(Sight2!DEC2_))*COS(RADIANS(T60))","v":-0.40898450136055386},{"$f":"COS(RADIANS(Sight2!DEC2_))*SIN(RADIANS(T60))","v":0.8385424942859363},null,null,null,null,116,{"$f":"COS(RADIANS(Sight2!HC2_))*COS(RADIANS(AA60))","v":-0.41628661522460203},{"$f":"COS(RADIANS(Sight2!HC2_))*SIN(RADIANS(AA60))","v":0.85351404639304362}]
[118,-0.46947156278589092,0.88294759285892688,null,-28,{"$f":"COS(RADIANS(E61))*COS(RADIANS(Sight2!LHA2_))","v":0.80022112716782112},-0.46947156278589081,{"$f":"F61*COS(RADIANS(90-Sight2!LAT2_))-G61*SIN(RADIANS(90-Sight2!LAT2_))","v":0.90542351938400678},{"$f":"F61*SIN(RADIANS(90-Sight2!LAT2_))+G61*COS(RADIANS(90-Sight2!LAT2_))","v":0.20239973116741999},null,{"$f":"COS(RADIANS(E61))*COS(RADIANS(Sight2!AZ_nord2-180))","v":0.80324089667324472},null,110,-0.93969262078590843,-0.34202014332566866,330,0.49999999999999972,0.86602540378443882,null,118,{"$f":"COS(RADIANS(Sight2!DEC2_))*COS(RADIANS(T61))","v":-0.43800007006695546},{"$f":"COS(RADIANS(Sight2!DEC2_))*SIN(RADIANS(T61))","v":0.82375832359847057},null,null,null,null,118,{"$f":"COS(RADIANS(Sight2!HC2_))*COS(RADIANS(AA61))","v":-0.44582023531392745},{"$f":"COS(RADIANS(Sight2!HC2_))*SIN(RADIANS(AA61))","v":0.83846591534183246}]
[120,-0.49999999999999978,0.86602540378443871,null,-30,{"$f":"COS(RADIANS(E62))*COS(RADIANS(Sight2!LHA2_))","v":0.78488443751052506},-0.49999999999999994,{"$f":"F62*COS(RADIANS(90-Sight2!LAT2_))-G62*SIN(RADIANS(90-Sight2!LAT2_))","v":0.91502731874785215},{"$f":"F62*SIN(RADIANS(90-Sight2!LAT2_))+G62*COS(RADIANS(90-Sight2!LAT2_))","v":0.16961304841116948},null,{"$f":"COS(RADIANS(E62))*COS(RADIANS(Sight2!AZ_nord2-180))","v":0.78784633142860294},null,115,-0.90630778703665005,-0.42261826174069927,345,0.25881904510252074,0.96592582628906831,null,120,{"$f":"COS(RADIANS(Sight2!DEC2_))*COS(RADIANS(T62))","v":-0.46648200315671867},{"$f":"COS(RADIANS(Sight2!DEC2_))*SIN(RADIANS(T62))","v":0.80797053028394261},null,null,null,null,120,{"$f":"COS(RADIANS(Sight2!HC2_))*COS(RADIANS(AA62))","v":-0.47481069211986521},{"$f":"COS(RADIANS(Sight2!HC2_))*SIN(RADIANS(AA62))","v":0.8223962427285505}]
[122,-0.52991926423320479,0.84804809615642607,null,-32,{"$f":"COS(RADIANS(E63))*COS(RADIANS(Sight2!LHA2_))","v":0.7685914870683016},-0.5299192642332049,{"$f":"F63*COS(RADIANS(90-Sight2!LAT2_))-G63*SIN(RADIANS(90-Sight2!LAT2_))","v":0.92351629827295678},{"$f":"F63*SIN(RADIANS(90-Sight2!LAT2_))+G63*COS(RADIANS(90-Sight2!LAT2_))","v":0.136619718282317},null,{"$f":"COS(RADIANS(E63))*COS(RADIANS(Sight2!AZ_nord2-180))","v":0.77149189678753938},null,120,-0.8660254037844386,-0.50000000000000011,null,null,null,null,122,{"$f":"COS(RADIANS(Sight2!DEC2_))*COS(RADIANS(T63))","v":-0.49439559978167996},{"$f":"COS(RADIANS(Sight2!DEC2_))*SIN(RADIANS(T63))","v":0.79119834933658284},null,null,null,null,122,{"$f":"COS(RADIANS(Sight2!HC2_))*COS(RADIANS(AA63))","v":-0.50322266523643566},{"$f":"COS(RADIANS(Sight2!HC2_))*SIN(RADIANS(AA63))","v":0.80532460697393371}]
[124,-0.55919290347074668,0.82903757255504174,null,-34,{"$f":"COS(RADIANS(E64))*COS(RADIANS(Sight2!LHA2_))","v":0.75136212629152799},-0.5591929034707469,{"$f":"F64*COS(RADIANS(90-Sight2!LAT2_))-G64*SIN(RADIANS(90-Sight2!LAT2_))","v":0.93088011544539606},{"$f":"F64*SIN(RADIANS(90-Sight2!LAT2_))+G64*COS(RADIANS(90-Sight2!LAT2_))","v":0.10345993807139175},null,{"$f":"COS(RADIANS(E64))*COS(RADIANS(Sight2!AZ_nord2-180))","v":0.75419751810945668},null,125,-0.8191520442889918,-0.57357643635104616,null,null,null,null,124,{"$f":"COS(RADIANS(Sight2!DEC2_))*COS(RADIANS(T64))","v":-0.52170685152411134},{"$f":"COS(RADIANS(Sight2!DEC2_))*SIN(RADIANS(T64))","v":0.77346221507531909},null,null,null,null,124,{"$f":"COS(RADIANS(Sight2!HC2_))*COS(RADIANS(AA64))","v":-0.53102153905092464},{"$f":"COS(RADIANS(Sight2!HC2_))*SIN(RADIANS(AA64))","v":0.78727180723646506}]
[126,-0.58778525229247303,0.80901699437494745,null,-36,{"$f":"COS(RADIANS(E65))*COS(RADIANS(Sight2!LHA2_))","v":0.73321734650233139},-0.58778525229247314,{"$f":"F65*COS(RADIANS(90-Sight2!LAT2_))-G65*SIN(RADIANS(90-Sight2!LAT2_))","v":0.93710979858825461},{"$f":"F65*SIN(RADIANS(90-Sight2!LAT2_))+G65*COS(RADIANS(90-Sight2!LAT2_))","v":7.0174107862708446E-2},null,{"$f":"COS(RADIANS(E65))*COS(RADIANS(Sight2!AZ_nord2-180))","v":0.73598426593077948},null,130,-0.76604444311897801,-0.64278760968653925,null,null,null,null,126,{"$f":"COS(RADIANS(Sight2!DEC2_))*COS(RADIANS(T65))","v":-0.5483824838307404},{"$f":"COS(RADIANS(Sight2!DEC2_))*SIN(RADIANS(T65))","v":0.75478373624770689},null,null,null,null,126,{"$f":"COS(RADIANS(Sight2!HC2_))*COS(RADIANS(AA65))","v":-0.55817344491767762},{"$f":"COS(RADIANS(Sight2!HC2_))*SIN(RADIANS(AA65))","v":0.7682598380718042}]
[128,{"$f":"COS(RADIANS(A66))","v":-0.61566147532565829},{"$f":"SIN(RADIANS(A66))","v":0.78801075360672201},null,-38,{"$f":"COS(RADIANS(E66))*COS(RADIANS(Sight2!LHA2_))","v":0.7141792543198956},-0.61566147532565829,{"$f":"F66*COS(RADIANS(90-Sight2!LAT2_))-G66*SIN(RADIANS(90-Sight2!LAT2_))","v":0.94219775779223203},{"$f":"F66*SIN(RADIANS(90-Sight2!LAT2_))+G66*COS(RADIANS(90-Sight2!LAT2_))","v":3.6802781313087063E-2},null,{"$f":"COS(RADIANS(E66))*COS(RADIANS(Sight2!AZ_nord2-180))","v":0.71687433029375081},null,135,-0.70710678118654768,-0.70710678118654746,null,null,null,null,128,{"$f":"COS(RADIANS(Sight2!DEC2_))*COS(RADIANS(T66))","v":-0.57438999655266787},{"$f":"COS(RADIANS(Sight2!DEC2_))*SIN(RADIANS(T66))","v":0.7351856697029987},null,null,null,null,128,{"$f":"COS(RADIANS(Sight2!HC2_))*COS(RADIANS(AA66))","v":-0.58464530242182655},{"$f":"COS(RADIANS(Sight2!HC2_))*SIN(RADIANS(AA66))","v":0.74831186263580884}]
[{"$f":"SUM(A66+2)","v":130},-0.64278760968653936,0.76604444311897801,null,{"$f":"SUM(E66-2)","v":-40},{"$f":"COS(RADIANS(E67))*COS(RADIANS(Sight2!LHA2_))","v":0.69427104472695167},{"$f":"SIN(RADIANS(E67))","v":-0.64278760968653925},{"$f":"F67*COS(RADIANS(90-Sight2!LAT2_))-G67*SIN(RADIANS(90-Sight2!LAT2_))","v":0.94613779416277788},{"$f":"F67*SIN(RADIANS(90-Sight2!LAT2_))+G67*COS(RADIANS(90-Sight2!LAT2_))","v":3.3866162434695313E-3},null,{"$f":"COS(RADIANS(E67))*COS(RADIANS(Sight2!AZ_nord2-180))","v":0.69689099371128449},null,140,-0.64278760968653947,-0.7660444431189779,null,null,null,null,130,{"$f":"COS(RADIANS(Sight2!DEC2_))*COS(RADIANS(T67))","v":-0.59969770354179208},{"$f":"COS(RADIANS(Sight2!DEC2_))*SIN(RADIANS(T67))","v":0.71469189266642819},null,null,null,null,{"$f":"SUM(AA66+2)","v":130},{"$f":"COS(RADIANS(Sight2!HC2_))*COS(RADIANS(AA67))","v":-0.61040485968267932},{"$f":"COS(RADIANS(Sight2!HC2_))*SIN(RADIANS(AA67))","v":0.72745218446379767}]
[132,-0.66913060635885824,0.74314482547739424,null,-42,{"$f":"COS(RADIANS(E68))*COS(RADIANS(Sight2!LHA2_))","v":0.67351697281026424},-0.66913060635885824,{"$f":"F68*COS(RADIANS(90-Sight2!LAT2_))-G68*SIN(RADIANS(90-Sight2!LAT2_))","v":0.94892510737249136},{"$f":"F68*SIN(RADIANS(90-Sight2!LAT2_))+G68*COS(RADIANS(90-Sight2!LAT2_))","v":-3.0033674896372431E-2},null,{"$f":"COS(RADIANS(E68))*COS(RADIANS(Sight2!AZ_nord2-180))","v":0.67605860280080943},null,145,-0.57357643635104638,-0.81915204428899158,null,null,null,null,132,{"$f":"COS(RADIANS(Sight2!DEC2_))*COS(RADIANS(T68))","v":-0.62427477125550024},{"$f":"COS(RADIANS(Sight2!DEC2_))*SIN(RADIANS(T68))","v":0.69332737364849029},null,null,null,null,132,{"$f":"COS(RADIANS(Sight2!HC2_))*COS(RADIANS(AA68))","v":-0.63542073264766941},{"$f":"COS(RADIANS(Sight2!HC2_))*SIN(RADIANS(AA68))","v":0.7057062178604363}]
[134,-0.69465837045899737,0.71933980033865108,null,-44,{"$f":"COS(RADIANS(E69))*COS(RADIANS(Sight2!LHA2_))","v":0.65194232420954379},-0.69465837045899725,{"$f":"F69*COS(RADIANS(90-Sight2!LAT2_))-G69*SIN(RADIANS(90-Sight2!LAT2_))","v":0.95055630150957882},{"$f":"F69*SIN(RADIANS(90-Sight2!LAT2_))+G69*COS(RADIANS(90-Sight2!LAT2_))","v":-6.3417374629686107E-2},null,{"$f":"COS(RADIANS(E69))*COS(RADIANS(Sight2!AZ_nord2-180))","v":0.65440253862166597},null,150,-0.50000000000000044,-0.86602540378443837,null,null,null,null,134,{"$f":"COS(RADIANS(Sight2!DEC2_))*COS(RADIANS(T69))","v":-0.64809125632259046},{"$f":"COS(RADIANS(Sight2!DEC2_))*SIN(RADIANS(T69))","v":0.67111814202465636},null,null,null,null,134,{"$f":"COS(RADIANS(Sight2!HC2_))*COS(RADIANS(AA69))","v":-0.65966244332898882},{"$f":"COS(RADIANS(Sight2!HC2_))*SIN(RADIANS(AA69))","v":0.68310045693632149}]
[136,-0.71933980033865119,0.69465837045899714,null,-46,{"$f":"COS(RADIANS(E70))*COS(RADIANS(Sight2!LHA2_))","v":0.62957338431079057},-0.71933980033865108,{"$f":"F70*COS(RADIANS(90-Sight2!LAT2_))-G70*SIN(RADIANS(90-Sight2!LAT2_))","v":0.95102938921525038},{"$f":"F70*SIN(RADIANS(90-Sight2!LAT2_))+G70*COS(RADIANS(90-Sight2!LAT2_))","v":-9.6723810060711235E-2},null,{"$f":"COS(RADIANS(E70))*COS(RADIANS(Sight2!AZ_nord2-180))","v":0.6319491857521955},null,155,-0.42261826174069916,-0.90630778703665005,null,null,null,null,136,{"$f":"COS(RADIANS(Sight2!DEC2_))*COS(RADIANS(T70))","v":-0.67111814202465647},{"$f":"COS(RADIANS(Sight2!DEC2_))*SIN(RADIANS(T70))","v":0.64809125632259024},null,null,null,null,136,{"$f":"COS(RADIANS(Sight2!HC2_))*COS(RADIANS(AA70))","v":-0.6831004569363216},{"$f":"COS(RADIANS(Sight2!HC2_))*SIN(RADIANS(AA70))","v":0.6596624433289886}]
[138,-0.74314482547739402,0.66913060635885835,null,-48,{"$f":"COS(RADIANS(E71))*COS(RADIANS(Sight2!LHA2_))","v":0.60643740622160025},-0.74314482547739424,{"$f":"F71*COS(RADIANS(90-Sight2!LAT2_))-G71*SIN(RADIANS(90-Sight2!LAT2_))","v":0.95034379410501035},{"$f":"F71*SIN(RADIANS(90-Sight2!LAT2_))+G71*COS(RADIANS(90-Sight2!LAT2_))","v":-0.12991240242833813},null,{"$f":"COS(RADIANS(E71))*COS(RADIANS(Sight2!AZ_nord2-180))","v":0.60872590014419581},null,160,-0.34202014332566855,-0.93969262078590843,null,null,null,null,138,{"$f":"COS(RADIANS(Sight2!DEC2_))*COS(RADIANS(T71))","v":-0.69332737364849006},{"$f":"COS(RADIANS(Sight2!DEC2_))*SIN(RADIANS(T71))","v":0.62427477125550035},null,null,null,null,138,{"$f":"COS(RADIANS(Sight2!HC2_))*COS(RADIANS(AA71))","v":-0.70570621786043608},{"$f":"COS(RADIANS(Sight2!HC2_))*SIN(RADIANS(AA71))","v":0.63542073264766952}]
[140,-0.7660444431189779,0.64278760968653947,null,-50,{"$f":"COS(RADIANS(E72))*COS(RADIANS(Sight2!LHA2_))","v":0.58256257756745011},-0.76604444311897801,{"$f":"F72*COS(RADIANS(90-Sight2!LAT2_))-G72*SIN(RADIANS(90-Sight2!LAT2_))","v":0.94850035147089273},{"$f":"F72*SIN(RADIANS(90-Sight2!LAT2_))+G72*COS(RADIANS(90-Sight2!LAT2_))","v":-0.16294271654507764},null,{"$f":"COS(RADIANS(E72))*COS(RADIANS(Sight2!AZ_nord2-180))","v":0.58476097579390707},null,165,-0.25881904510252063,-0.96592582628906831,null,null,null,null,140,{"$f":"COS(RADIANS(Sight2!DEC2_))*COS(RADIANS(T72))","v":-0.71469189266642807},{"$f":"COS(RADIANS(Sight2!DEC2_))*SIN(RADIANS(T72))","v":0.59969770354179219},null,null,null,null,140,{"$f":"COS(RADIANS(Sight2!HC2_))*COS(RADIANS(AA72))","v":-0.72745218446379756},{"$f":"COS(RADIANS(Sight2!HC2_))*SIN(RADIANS(AA72))","v":0.61040485968267943}]
[142,-0.7880107536067219,0.6156614753256584,null,-52,{"$f":"COS(RADIANS(E73))*COS(RADIANS(Sight2!LHA2_))","v":0.55797798614941985},-0.78801075360672201,{"$f":"F73*COS(RADIANS(90-Sight2!LAT2_))-G73*SIN(RADIANS(90-Sight2!LAT2_))","v":0.94550130726378634},{"$f":"F73*SIN(RADIANS(90-Sight2!LAT2_))+G73*COS(RADIANS(90-Sight2!LAT2_))","v":-0.19577451006110841},null,{"$f":"COS(RADIANS(E73))*COS(RADIANS(Sight2!AZ_nord2-180))","v":0.56008361027013653},null,170,-0.17364817766693033,-0.98480775301220802,null,null,null,null,142,{"$f":"COS(RADIANS(Sight2!DEC2_))*COS(RADIANS(T73))","v":-0.73518566970299859},{"$f":"COS(RADIANS(Sight2!DEC2_))*SIN(RADIANS(T73))","v":0.57438999655266798},null,null,null,null,142,{"$f":"COS(RADIANS(Sight2!HC2_))*COS(RADIANS(AA73))","v":-0.74831186263580873},{"$f":"COS(RADIANS(Sight2!HC2_))*SIN(RADIANS(AA73))","v":0.58464530242182666}]
[144,-0.80901699437494734,0.58778525229247325,null,-54,{"$f":"COS(RADIANS(E74))*COS(RADIANS(Sight2!LHA2_))","v":0.53271358450518647},-0.80901699437494745,{"$f":"F74*COS(RADIANS(90-Sight2!LAT2_))-G74*SIN(RADIANS(90-Sight2!LAT2_))","v":0.94135031535709057},{"$f":"F74*SIN(RADIANS(90-Sight2!LAT2_))+G74*COS(RADIANS(90-Sight2!LAT2_))","v":-0.22836778249338108},null,{"$f":"COS(RADIANS(E74))*COS(RADIANS(Sight2!AZ_nord2-180))","v":0.53472386914151837},null,175,-8.7155742747658249E-2,-0.99619469809174555,null,null,null,null,144,{"$f":"COS(RADIANS(Sight2!DEC2_))*COS(RADIANS(T74))","v":-0.75478373624770678},{"$f":"COS(RADIANS(Sight2!DEC2_))*SIN(RADIANS(T74))","v":0.54838248383074062},null,null,null,null,144,{"$f":"COS(RADIANS(Sight2!HC2_))*COS(RADIANS(AA74))","v":-0.76825983807180409},{"$f":"COS(RADIANS(Sight2!HC2_))*SIN(RADIANS(AA74))","v":0.55817344491767784}]
[146,-0.82903757255504162,0.5591929034707469,null,-56,{"$f":"COS(RADIANS(E75))*COS(RADIANS(Sight2!LHA2_))","v":0.50680015341647056},-0.82903757255504174,{"$f":"F75*COS(RADIANS(90-Sight2!LAT2_))-G75*SIN(RADIANS(90-Sight2!LAT2_))","v":0.93605243309503228},{"$f":"F75*SIN(RADIANS(90-Sight2!LAT2_))+G75*COS(RADIANS(90-Sight2!LAT2_))","v":-0.26068282396004588},null,{"$f":"COS(RADIANS(E75))*COS(RADIANS(Sight2!AZ_nord2-180))","v":0.50871264934624882},null,180,-1.83772268236293E-16,-1,null,null,null,null,146,{"$f":"COS(RADIANS(Sight2!DEC2_))*COS(RADIANS(T75))","v":-0.77346221507531898},{"$f":"COS(RADIANS(Sight2!DEC2_))*SIN(RADIANS(T75))","v":0.52170685152411156},null,null,null,null,146,{"$f":"COS(RADIANS(Sight2!HC2_))*COS(RADIANS(AA75))","v":-0.78727180723646495},{"$f":"COS(RADIANS(Sight2!HC2_))*SIN(RADIANS(AA75))","v":0.53102153905092486}]
[148,-0.84804809615642596,0.5299192642332049,null,-58,{"$f":"COS(RADIANS(E76))*COS(RADIANS(Sight2!LHA2_))","v":0.48026926440739581},-0.84804809615642596,{"$f":"F76*COS(RADIANS(90-Sight2!LAT2_))-G76*SIN(RADIANS(90-Sight2!LAT2_))","v":0.92961411513107151},{"$f":"F76*SIN(RADIANS(90-Sight2!LAT2_))+G76*COS(RADIANS(90-Sight2!LAT2_))","v":-0.29268026356082594},null,{"$f":"COS(RADIANS(E76))*COS(RADIANS(Sight2!AZ_nord2-180))","v":0.48208164154892746},null,185,8.7155742747657888E-2,-0.99619469809174555,null,null,null,null,148,{"$f":"COS(RADIANS(Sight2!DEC2_))*COS(RADIANS(T76))","v":-0.79119834933658273},{"$f":"COS(RADIANS(Sight2!DEC2_))*SIN(RADIANS(T76))","v":0.49439559978168007},null,null,null,null,148,{"$f":"COS(RADIANS(Sight2!HC2_))*COS(RADIANS(AA76))","v":-0.8053246069739336},{"$f":"COS(RADIANS(Sight2!HC2_))*SIN(RADIANS(AA76))","v":0.50322266523643577}]
[150,-0.86602540378443871,0.49999999999999994,null,-60,{"$f":"COS(RADIANS(E77))*COS(RADIANS(Sight2!LHA2_))","v":0.45315324127944973},-0.8660254037844386,{"$f":"F77*COS(RADIANS(90-Sight2!LAT2_))-G77*SIN(RADIANS(90-Sight2!LAT2_))","v":0.92204320556390085},{"$f":"F77*SIN(RADIANS(90-Sight2!LAT2_))+G77*COS(RADIANS(90-Sight2!LAT2_))","v":-0.32432111734439556},null,{"$f":"COS(RADIANS(E77))*COS(RADIANS(Sight2!AZ_nord2-180))","v":0.45486329153036309},null,190,0.17364817766692997,-0.98480775301220813,null,null,null,null,150,{"$f":"COS(RADIANS(Sight2!DEC2_))*COS(RADIANS(T77))","v":-0.80797053028394261},{"$f":"COS(RADIANS(Sight2!DEC2_))*SIN(RADIANS(T77))","v":0.46648200315671884},null,null,null,null,150,{"$f":"COS(RADIANS(Sight2!HC2_))*COS(RADIANS(AA77))","v":-0.8223962427285505},{"$f":"COS(RADIANS(Sight2!HC2_))*SIN(RADIANS(AA77))","v":0.47481069211986537}]
[152,-0.88294759285892699,0.46947156278589069,null,-62,{"$f":"COS(RADIANS(E78))*COS(RADIANS(Sight2!LHA2_))","v":0.42548512072991018},-0.88294759285892688,{"$f":"F78*COS(RADIANS(90-Sight2!LAT2_))-G78*SIN(RADIANS(90-Sight2!LAT2_))","v":0.91334892838061821},{"$f":"F78*SIN(RADIANS(90-Sight2!LAT2_))+G78*COS(RADIANS(90-Sight2!LAT2_))","v":-0.35556683580431953},null,{"$f":"COS(RADIANS(E78))*COS(RADIANS(Sight2!AZ_nord2-180))","v":0.42709076065738755},null,195,0.2588190451025203,-0.96592582628906842,null,null,null,null,152,{"$f":"COS(RADIANS(Sight2!DEC2_))*COS(RADIANS(T78))","v":-0.82375832359847068},{"$f":"COS(RADIANS(Sight2!DEC2_))*SIN(RADIANS(T78))","v":0.43800007006695524},null,null,null,null,152,{"$f":"COS(RADIANS(Sight2!HC2_))*COS(RADIANS(AA78))","v":-0.83846591534183257},{"$f":"COS(RADIANS(Sight2!HC2_))*SIN(RADIANS(AA78))","v":0.44582023531392723}]
[154,-0.89879404629916704,0.43837114678907729,null,-64,{"$f":"COS(RADIANS(E79))*COS(RADIANS(Sight2!LHA2_))","v":0.39729861210171968},-0.89879404629916704,{"$f":"F79*COS(RADIANS(90-Sight2!LAT2_))-G79*SIN(RADIANS(90-Sight2!LAT2_))","v":0.90354187621872084},{"$f":"F79*SIN(RADIANS(90-Sight2!LAT2_))+G79*COS(RADIANS(90-Sight2!LAT2_))","v":-0.38637935084568836},null,{"$f":"COS(RADIANS(E79))*COS(RADIANS(Sight2!AZ_nord2-180))","v":0.39879788548083939},null,200,0.34202014332566899,-0.93969262078590832,null,null,null,null,154,{"$f":"COS(RADIANS(Sight2!DEC2_))*COS(RADIANS(T79))","v":-0.83854249428593641},{"$f":"COS(RADIANS(Sight2!DEC2_))*SIN(RADIANS(T79))","v":0.4089845013605537},null,null,null,null,154,{"$f":"COS(RADIANS(Sight2!HC2_))*COS(RADIANS(AA79))","v":-0.85351404639304373},{"$f":"COS(RADIANS(Sight2!HC2_))*SIN(RADIANS(AA79))","v":0.41628661522460181}]
[156,-0.91354545764260076,0.40673664307580043,null,-66,{"$f":"COS(RADIANS(E80))*COS(RADIANS(Sight2!LHA2_))","v":0.36862805631384293},-0.91354545764260087,{"$f":"F80*COS(RADIANS(90-Sight2!LAT2_))-G80*SIN(RADIANS(90-Sight2!LAT2_))","v":0.89263399746060745},{"$f":"F80*SIN(RADIANS(90-Sight2!LAT2_))+G80*COS(RADIANS(90-Sight2!LAT2_))","v":-0.41672112216522805},null,{"$f":"COS(RADIANS(E80))*COS(RADIANS(Sight2!AZ_nord2-180))","v":0.37001913651093782},null,205,0.42261826174069961,-0.90630778703664994,null,null,null,null,156,{"$f":"COS(RADIANS(Sight2!DEC2_))*COS(RADIANS(T80))","v":-0.85230503011168379},{"$f":"COS(RADIANS(Sight2!DEC2_))*SIN(RADIANS(T80))","v":0.37947064803847758},null,null,null,null,156,{"$f":"COS(RADIANS(Sight2!HC2_))*COS(RADIANS(AA80))","v":-0.86752230205248493},{"$f":"COS(RADIANS(Sight2!HC2_))*SIN(RADIANS(AA80))","v":0.38624581401866293}]
[158,-0.92718385456678731,0.37460659341591224,null,-68,{"$f":"COS(RADIANS(E81))*COS(RADIANS(Sight2!LHA2_))","v":0.33950838402214689},-0.92718385456678742,{"$f":"F81*COS(RADIANS(90-Sight2!LAT2_))-G81*SIN(RADIANS(90-Sight2!LAT2_))","v":0.88063858167631515},{"$f":"F81*SIN(RADIANS(90-Sight2!LAT2_))+G81*COS(RADIANS(90-Sight2!LAT2_))","v":-0.44655518298837743},null,{"$f":"COS(RADIANS(E81))*COS(RADIANS(Sight2!AZ_nord2-180))","v":0.34078957622027622},null,210,0.50000000000000011,-0.8660254037844386,null,null,null,null,158,{"$f":"COS(RADIANS(Sight2!DEC2_))*COS(RADIANS(T81))","v":-0.86502916354576576},{"$f":"COS(RADIANS(Sight2!DEC2_))*SIN(RADIANS(T81))","v":0.34949446818473856},null,null,null,null,158,{"$f":"COS(RADIANS(Sight2!HC2_))*COS(RADIANS(AA81))","v":-0.88047361541844182},{"$f":"COS(RADIANS(Sight2!HC2_))*SIN(RADIANS(AA81))","v":0.35573443178494862}]
[160,-0.93969262078590832,0.34202014332566888,null,-70,{"$f":"COS(RADIANS(E82))*COS(RADIANS(Sight2!LHA2_))","v":0.30997507306177746},-0.93969262078590832,{"$f":"F82*COS(RADIANS(90-Sight2!LAT2_))-G82*SIN(RADIANS(90-Sight2!LAT2_))","v":0.86757024343222444},{"$f":"F82*SIN(RADIANS(90-Sight2!LAT2_))+G82*COS(RADIANS(90-Sight2!LAT2_))","v":-0.47584518510760809},null,{"$f":"COS(RADIANS(E82))*COS(RADIANS(Sight2!AZ_nord2-180))","v":0.31114481632560048},null,215,0.57357643635104605,-0.8191520442889918,null,null,null,null,160,{"$f":"COS(RADIANS(Sight2!DEC2_))*COS(RADIANS(T82))","v":-0.87669939219159509},{"$f":"COS(RADIANS(Sight2!DEC2_))*SIN(RADIANS(T82))","v":0.31909248315701222},null,null,null,null,160,{"$f":"COS(RADIANS(Sight2!HC2_))*COS(RADIANS(AA82))","v":-0.89235220731057474},{"$f":"COS(RADIANS(Sight2!HC2_))*SIN(RADIANS(AA82))","v":0.32478964194279281}]
[162,-0.95105651629515353,0.30901699437494751,null,-72,{"$f":"COS(RADIANS(E83))*COS(RADIANS(Sight2!LHA2_))","v":0.28006410522288178},-0.95105651629515353,{"$f":"F83*COS(RADIANS(90-Sight2!LAT2_))-G83*SIN(RADIANS(90-Sight2!LAT2_))","v":0.85344490448546306},{"$f":"F83*SIN(RADIANS(90-Sight2!LAT2_))+G83*COS(RADIANS(90-Sight2!LAT2_))","v":-0.50455544316711709},null,{"$f":"COS(RADIANS(E83))*COS(RADIANS(Sight2!AZ_nord2-180))","v":0.2811209744004165},null,220,0.64278760968653925,-0.76604444311897812,null,null,null,null,162,{"$f":"COS(RADIANS(Sight2!DEC2_))*COS(RADIANS(T83))","v":-0.88730149767322775},{"$f":"COS(RADIANS(Sight2!DEC2_))*SIN(RADIANS(T83))","v":0.28830173309098811},null,null,null,null,162,{"$f":"COS(RADIANS(Sight2!HC2_))*COS(RADIANS(AA83))","v":-0.90314360549441985},{"$f":"COS(RADIANS(Sight2!HC2_))*SIN(RADIANS(AA83))","v":0.29344914595193877}]
[164,-0.96126169593831889,0.27563735581699922,null,-74,{"$f":"COS(RADIANS(E84))*COS(RADIANS(Sight2!LHA2_))","v":0.24981192241234026},-0.96126169593831889,{"$f":"F84*COS(RADIANS(90-Sight2!LAT2_))-G84*SIN(RADIANS(90-Sight2!LAT2_))","v":0.83827977438569556},{"$f":"F84*SIN(RADIANS(90-Sight2!LAT2_))+G84*COS(RADIANS(90-Sight2!LAT2_))","v":-0.53265097813993489},null,{"$f":"COS(RADIANS(E84))*COS(RADIANS(Sight2!AZ_nord2-180))","v":0.25075462987129216},null,225,0.70710678118654735,-0.70710678118654768,null,null,null,null,164,{"$f":"COS(RADIANS(Sight2!DEC2_))*COS(RADIANS(T84))","v":-0.89682256295826368},{"$f":"COS(RADIANS(Sight2!DEC2_))*SIN(RADIANS(T84))","v":0.25715973177267015},null,null,null,null,164,{"$f":"COS(RADIANS(Sight2!HC2_))*COS(RADIANS(AA84))","v":-0.91283466231357768},{"$f":"COS(RADIANS(Sight2!HC2_))*SIN(RADIANS(AA84))","v":0.26175112737911804}]
[166,-0.97029572627599647,0.24192189559966773,null,-76,{"$f":"COS(RADIANS(E85))*COS(RADIANS(Sight2!LHA2_))","v":0.21925538225491606},-0.97029572627599647,{"$f":"F85*COS(RADIANS(90-Sight2!LAT2_))-G85*SIN(RADIANS(90-Sight2!LAT2_))","v":0.82209332950793956},{"$f":"F85*SIN(RADIANS(90-Sight2!LAT2_))+G85*COS(RADIANS(90-Sight2!LAT2_))","v":-0.56009755994448251},null,{"$f":"COS(RADIANS(E85))*COS(RADIANS(Sight2!AZ_nord2-180))","v":0.22008277945145935},null,230,0.76604444311897779,-0.64278760968653958,null,null,null,null,166,{"$f":"COS(RADIANS(Sight2!DEC2_))*COS(RADIANS(T85))","v":-0.9052509880952605},{"$f":"COS(RADIANS(Sight2!DEC2_))*SIN(RADIANS(T85))","v":0.22570442093360724},null,null,null,null,166,{"$f":"COS(RADIANS(Sight2!HC2_))*COS(RADIANS(AA85))","v":-0.92141357070810681},{"$f":"COS(RADIANS(Sight2!HC2_))*SIN(RADIANS(AA85))","v":0.22973420537725611}]
[168,-0.97814760073380569,0.20791169081775931,null,-78,{"$f":"COS(RADIANS(E86))*COS(RADIANS(Sight2!LHA2_))","v":0.18843171318791696},-0.97814760073380558,{"$f":"F86*COS(RADIANS(90-Sight2!LAT2_))-G86*SIN(RADIANS(90-Sight2!LAT2_))","v":0.80490529054194793},{"$f":"F86*SIN(RADIANS(90-Sight2!LAT2_))+G86*COS(RADIANS(90-Sight2!LAT2_))","v":-0.58686174914865263},null,{"$f":"COS(RADIANS(E86))*COS(RADIANS(Sight2!AZ_nord2-180))","v":0.18914279206601842},null,235,0.81915204428899158,-0.57357643635104649,null,null,null,null,168,{"$f":"COS(RADIANS(Sight2!DEC2_))*COS(RADIANS(T86))","v":-0.91257650434648829},{"$f":"COS(RADIANS(Sight2!DEC2_))*SIN(RADIANS(T86))","v":0.19397412402473752},null,null,null,null,168,{"$f":"COS(RADIANS(Sight2!HC2_))*COS(RADIANS(AA86))","v":-0.92886987859960812},{"$f":"COS(RADIANS(Sight2!HC2_))*SIN(RADIANS(AA86))","v":0.19743738763398355}]
[170,-0.98480775301220802,0.17364817766693028,null,-80,{"$f":"COS(RADIANS(E87))*COS(RADIANS(Sight2!LHA2_))","v":0.15737846910407852},-0.98480775301220802,{"$f":"F87*COS(RADIANS(90-Sight2!LAT2_))-G87*SIN(RADIANS(90-Sight2!LAT2_))","v":0.78673659846558597},{"$f":"F87*SIN(RADIANS(90-Sight2!LAT2_))+G87*COS(RADIANS(90-Sight2!LAT2_))","v":-0.61291093771060789},null,{"$f":"COS(RADIANS(E87))*COS(RADIANS(Sight2!AZ_nord2-180))","v":0.15797236332365847},null,240,0.86602540378443837,-0.50000000000000044,null,null,null,null,170,{"$f":"COS(RADIANS(Sight2!DEC2_))*COS(RADIANS(T87))","v":-0.91879018669880408},{"$f":"COS(RADIANS(Sight2!DEC2_))*SIN(RADIANS(T87))","v":0.16200749952516691},null,null,null,null,170,{"$f":"COS(RADIANS(Sight2!HC2_))*COS(RADIANS(AA87))","v":-0.93519450162547191},{"$f":"COS(RADIANS(Sight2!HC2_))*SIN(RADIANS(AA87))","v":0.16490002284677704}]
[172,-0.99026806874157036,0.13917310096006533,null,-82,{"$f":"COS(RADIANS(E88))*COS(RADIANS(Sight2!LHA2_))","v":0.1261334835979315},-0.99026806874157036,{"$f":"F88*COS(RADIANS(90-Sight2!LAT2_))-G88*SIN(RADIANS(90-Sight2!LAT2_))","v":0.76760938903147657},{"$f":"F88*SIN(RADIANS(90-Sight2!LAT2_))+G88*COS(RADIANS(90-Sight2!LAT2_))","v":-0.63821338870665523},null,{"$f":"COS(RADIANS(E88))*COS(RADIANS(Sight2!AZ_nord2-180))","v":0.12660946959036579},null,245,0.90630778703665005,-0.42261826174069922,null,null,null,null,172,{"$f":"COS(RADIANS(Sight2!DEC2_))*COS(RADIANS(T88))","v":-0.92388446473740626},{"$f":"COS(RADIANS(Sight2!DEC2_))*SIN(RADIANS(T88))","v":0.12984349384276711},null,null,null,null,172,{"$f":"COS(RADIANS(Sight2!HC2_))*COS(RADIANS(AA88))","v":-0.94037973420677501},{"$f":"COS(RADIANS(Sight2!HC2_))*SIN(RADIANS(AA88))","v":0.13216175278263306}]
[174,-0.99452189536827329,0.10452846326765373,null,-84,{"$f":"COS(RADIANS(E89))*COS(RADIANS(Sight2!LHA2_))","v":9.4734823871394105E-2},-0.99452189536827329,{"$f":"F89*COS(RADIANS(90-Sight2!LAT2_))-G89*SIN(RADIANS(90-Sight2!LAT2_))","v":0.74754696579799429},{"$f":"F89*SIN(RADIANS(90-Sight2!LAT2_))+G89*COS(RADIANS(90-Sight2!LAT2_))","v":-0.66273827499779969},null,{"$f":"COS(RADIANS(E89))*COS(RADIANS(Sight2!AZ_nord2-180))","v":9.5092321721070988E-2},null,250,0.93969262078590843,-0.3420201433256686,null,null,null,null,174,{"$f":"COS(RADIANS(Sight2!DEC2_))*COS(RADIANS(T89))","v":-0.92785313186921781},{"$f":"COS(RADIANS(Sight2!DEC2_))*SIN(RADIANS(T89))","v":9.7521293863977246E-2},null,null,null,null,174,{"$f":"COS(RADIANS(Sight2!HC2_))*COS(RADIANS(AA89))","v":-0.94441925893634049},{"$f":"COS(RADIANS(Sight2!HC2_))*SIN(RADIANS(AA89))","v":9.9262463980681198E-2}]
[176,-0.9975640502598242,6.9756473744125524E-2,null,-86,{"$f":"COS(RADIANS(E90))*COS(RADIANS(Sight2!LHA2_))","v":6.3220744354750349E-2},-0.9975640502598242,{"$f":"F90*COS(RADIANS(90-Sight2!LAT2_))-G90*SIN(RADIANS(90-Sight2!LAT2_))","v":0.72657377173746984},{"$f":"F90*SIN(RADIANS(90-Sight2!LAT2_))+G90*COS(RADIANS(90-Sight2!LAT2_))","v":-0.68645571678786443},null,{"$f":"COS(RADIANS(E90))*COS(RADIANS(Sight2!AZ_nord2-180))","v":6.3459318505608292E-2},null,255,0.96592582628906831,-0.25881904510252068,null,null,null,null,176,{"$f":"COS(RADIANS(Sight2!DEC2_))*COS(RADIANS(T90))","v":-0.9306913528846652},{"$f":"COS(RADIANS(Sight2!DEC2_))*SIN(RADIANS(T90))","v":6.5080279210617487E-2},null,null,null,null,176,{"$f":"COS(RADIANS(Sight2!HC2_))*COS(RADIANS(AA90))","v":-0.94730815427552673},{"$f":"COS(RADIANS(Sight2!HC2_))*SIN(RADIANS(AA90))","v":6.6242239156578925E-2}]
[178,-0.99939082701909576,3.4899496702501143E-2,null,-88,{"$f":"COS(RADIANS(E91))*COS(RADIANS(Sight2!LHA2_))","v":3.1629640099519657E-2},-0.99939082701909576,{"$f":"F91*COS(RADIANS(90-Sight2!LAT2_))-G91*SIN(RADIANS(90-Sight2!LAT2_))","v":0.70471535945619324},{"$f":"F91*SIN(RADIANS(90-Sight2!LAT2_))+G91*COS(RADIANS(90-Sight2!LAT2_))","v":-0.70933681802742032},null,{"$f":"COS(RADIANS(E91))*COS(RADIANS(Sight2!AZ_nord2-180))","v":3.1748999885705384E-2},null,260,0.98480775301220802,-0.17364817766693039,null,null,null,null,178,{"$f":"COS(RADIANS(Sight2!DEC2_))*COS(RADIANS(T91))","v":-0.93239566984863542},{"$f":"COS(RADIANS(Sight2!DEC2_))*SIN(RADIANS(T91))","v":3.2559974261888079E-2},null,null,null,null,178,{"$f":"COS(RADIANS(Sight2!HC2_))*COS(RADIANS(AA91))","v":-0.94904290055036311},{"$f":"COS(RADIANS(Sight2!HC2_))*SIN(RADIANS(AA91))","v":3.314130836789906E-2}]
[180,-1,1.22514845490862E-16,null,-90,{"$f":"COS(RADIANS(E92))*COS(RADIANS(Sight2!LHA2_))","v":5.5517999339035083E-17},-1,{"$f":"F92*COS(RADIANS(90-Sight2!LAT2_))-G92*SIN(RADIANS(90-Sight2!LAT2_))","v":0.68199836006249848},{"$f":"F92*SIN(RADIANS(90-Sight2!LAT2_))+G92*COS(RADIANS(90-Sight2!LAT2_))","v":-0.73135370161917046},null,{"$f":"COS(RADIANS(E92))*COS(RADIANS(Sight2!AZ_nord2-180))","v":5.5727505881307343E-17},null,265,0.99619469809174555,-8.7155742747658319E-2,null,null,null,null,180,{"$f":"COS(RADIANS(Sight2!DEC2_))*COS(RADIANS(T92))","v":-0.93296400631343779},{"$f":"COS(RADIANS(Sight2!DEC2_))*SIN(RADIANS(T92))","v":1.1430194108202644E-16},null,null,null,null,180,{"$f":"COS(RADIANS(Sight2!HC2_))*COS(RADIANS(AA92))","v":-0.94962138423973086},{"$f":"COS(RADIANS(Sight2!HC2_))*SIN(RADIANS(AA92))","v":1.1634271716494912E-16}]
[182,-0.99939082701909576,-3.48994967025009E-2,null,-92,{"$f":"COS(RADIANS(E93))*COS(RADIANS(Sight2!LHA2_))","v":-3.1629640099519546E-2},-0.99939082701909576,{"$f":"F93*COS(RADIANS(90-Sight2!LAT2_))-G93*SIN(RADIANS(90-Sight2!LAT2_))","v":0.65845045072086161},{"$f":"F93*SIN(RADIANS(90-Sight2!LAT2_))+G93*COS(RADIANS(90-Sight2!LAT2_))","v":-0.75247954338189915},null,{"$f":"COS(RADIANS(E93))*COS(RADIANS(Sight2!AZ_nord2-180))","v":-3.1748999885705266E-2},null,270,1,-2.45029690981724E-16,null,null,null,null,182,{"$f":"COS(RADIANS(Sight2!DEC2_))*COS(RADIANS(T93))","v":-0.93239566984863542},{"$f":"COS(RADIANS(Sight2!DEC2_))*SIN(RADIANS(T93))","v":-3.255997426188785E-2},null,null,null,null,182,{"$f":"COS(RADIANS(Sight2!HC2_))*COS(RADIANS(AA93))","v":-0.94904290055036311},{"$f":"COS(RADIANS(Sight2!HC2_))*SIN(RADIANS(AA93))","v":-3.3141308367898824E-2}]
[184,-0.9975640502598242,-6.9756473744125275E-2,null,-94,{"$f":"COS(RADIANS(E94))*COS(RADIANS(Sight2!LHA2_))","v":-6.3220744354750433E-2},-0.9975640502598242,{"$f":"F94*COS(RADIANS(90-Sight2!LAT2_))-G94*SIN(RADIANS(90-Sight2!LAT2_))","v":0.6341003209315379},{"$f":"F94*SIN(RADIANS(90-Sight2!LAT2_))+G94*COS(RADIANS(90-Sight2!LAT2_))","v":-0.77268860473160483},null,{"$f":"COS(RADIANS(E94))*COS(RADIANS(Sight2!AZ_nord2-180))","v":-6.3459318505608375E-2},null,275,0.99619469809174555,8.7155742747657833E-2,null,null,null,null,184,{"$f":"COS(RADIANS(Sight2!DEC2_))*COS(RADIANS(T94))","v":-0.9306913528846652},{"$f":"COS(RADIANS(Sight2!DEC2_))*SIN(RADIANS(T94))","v":-6.5080279210617251E-2},null,null,null,null,184,{"$f":"COS(RADIANS(Sight2!HC2_))*COS(RADIANS(AA94))","v":-0.94730815427552673},{"$f":"COS(RADIANS(Sight2!HC2_))*SIN(RADIANS(AA94))","v":-6.6242239156578689E-2}]
[186,-0.99452189536827329,-0.1045284632676535,null,-96,{"$f":"COS(RADIANS(E95))*COS(RADIANS(Sight2!LHA2_))","v":-9.4734823871394189E-2},-0.99452189536827329,{"$f":"F95*COS(RADIANS(90-Sight2!LAT2_))-G95*SIN(RADIANS(90-Sight2!LAT2_))","v":0.60897763757682577},{"$f":"F95*SIN(RADIANS(90-Sight2!LAT2_))+G95*COS(RADIANS(90-Sight2!LAT2_))","v":-0.79195626404000052},null,{"$f":"COS(RADIANS(E95))*COS(RADIANS(Sight2!AZ_nord2-180))","v":-9.5092321721071071E-2},null,280,0.98480775301220813,0.17364817766692991,null,null,null,null,186,{"$f":"COS(RADIANS(Sight2!DEC2_))*COS(RADIANS(T95))","v":-0.92785313186921781},{"$f":"COS(RADIANS(Sight2!DEC2_))*SIN(RADIANS(T95))","v":-9.7521293863977024E-2},null,null,null,null,186,{"$f":"COS(RADIANS(Sight2!HC2_))*COS(RADIANS(AA95))","v":-0.94441925893634049},{"$f":"COS(RADIANS(Sight2!HC2_))*SIN(RADIANS(AA95))","v":-9.9262463980680976E-2}]
[188,-0.99026806874157025,-0.13917310096006552,null,-98,{"$f":"COS(RADIANS(E96))*COS(RADIANS(Sight2!LHA2_))","v":-0.12613348359793139},-0.99026806874157036,{"$f":"F96*COS(RADIANS(90-Sight2!LAT2_))-G96*SIN(RADIANS(90-Sight2!LAT2_))","v":0.58311300877654038},{"$f":"F96*SIN(RADIANS(90-Sight2!LAT2_))+G96*COS(RADIANS(90-Sight2!LAT2_))","v":-0.81025904663217385},null,{"$f":"COS(RADIANS(E96))*COS(RADIANS(Sight2!AZ_nord2-180))","v":-0.1266094695903657},null,285,0.96592582628906842,0.25881904510252024,null,null,null,null,188,{"$f":"COS(RADIANS(Sight2!DEC2_))*COS(RADIANS(T96))","v":-0.92388446473740615},{"$f":"COS(RADIANS(Sight2!DEC2_))*SIN(RADIANS(T96))","v":-0.12984349384276728},null,null,null,null,188,{"$f":"COS(RADIANS(Sight2!HC2_))*COS(RADIANS(AA96))","v":-0.9403797342067749},{"$f":"COS(RADIANS(Sight2!HC2_))*SIN(RADIANS(AA96))","v":-0.13216175278263323}]
[190,-0.98480775301220802,-0.17364817766693047,null,-100,{"$f":"COS(RADIANS(E97))*COS(RADIANS(Sight2!LHA2_))","v":-0.15737846910407841},-0.98480775301220802,{"$f":"F97*COS(RADIANS(90-Sight2!LAT2_))-G97*SIN(RADIANS(90-Sight2!LAT2_))","v":0.55653794659673395},{"$f":"F97*SIN(RADIANS(90-Sight2!LAT2_))+G97*COS(RADIANS(90-Sight2!LAT2_))","v":-0.82757465338686409},null,{"$f":"COS(RADIANS(E97))*COS(RADIANS(Sight2!AZ_nord2-180))","v":-0.15797236332365838},null,290,0.93969262078590832,0.34202014332566893,null,null,null,null,190,{"$f":"COS(RADIANS(Sight2!DEC2_))*COS(RADIANS(T97))","v":-0.91879018669880408},{"$f":"COS(RADIANS(Sight2!DEC2_))*SIN(RADIANS(T97))","v":-0.16200749952516708},null,null,null,null,190,{"$f":"COS(RADIANS(Sight2!HC2_))*COS(RADIANS(AA97))","v":-0.93519450162547191},{"$f":"COS(RADIANS(Sight2!HC2_))*SIN(RADIANS(AA97))","v":-0.16490002284677724}]
[192,-0.97814760073380558,-0.20791169081775951,null,-102,{"$f":"COS(RADIANS(E98))*COS(RADIANS(Sight2!LHA2_))","v":-0.18843171318791685},-0.97814760073380569,{"$f":"F98*COS(RADIANS(90-Sight2!LAT2_))-G98*SIN(RADIANS(90-Sight2!LAT2_))","v":0.52928482865709814},{"$f":"F98*SIN(RADIANS(90-Sight2!LAT2_))+G98*COS(RADIANS(90-Sight2!LAT2_))","v":-0.84388198790450553},null,{"$f":"COS(RADIANS(E98))*COS(RADIANS(Sight2!AZ_nord2-180))","v":-0.18914279206601831},null,295,0.90630778703664994,0.42261826174069955,null,null,null,null,192,{"$f":"COS(RADIANS(Sight2!DEC2_))*COS(RADIANS(T98))","v":-0.91257650434648818},{"$f":"COS(RADIANS(Sight2!DEC2_))*SIN(RADIANS(T98))","v":-0.19397412402473771},null,null,null,null,192,{"$f":"COS(RADIANS(Sight2!HC2_))*COS(RADIANS(AA98))","v":-0.92886987859960801},{"$f":"COS(RADIANS(Sight2!HC2_))*SIN(RADIANS(AA98))","v":-0.19743738763398372}]
[194,-0.97029572627599647,-0.24192189559966751,null,-104,{"$f":"COS(RADIANS(E99))*COS(RADIANS(Sight2!LHA2_))","v":-0.21925538225491614},-0.97029572627599647,{"$f":"F99*COS(RADIANS(90-Sight2!LAT2_))-G99*SIN(RADIANS(90-Sight2!LAT2_))","v":0.50138685868382149},{"$f":"F99*SIN(RADIANS(90-Sight2!LAT2_))+G99*COS(RADIANS(90-Sight2!LAT2_))","v":-0.85916118220994053},null,{"$f":"COS(RADIANS(E99))*COS(RADIANS(Sight2!AZ_nord2-180))","v":-0.22008277945145946},null,300,0.8660254037844386,0.5,null,null,null,null,{"$f":"SUM(T98+2)","v":194},{"$f":"COS(RADIANS(Sight2!DEC2_))*COS(RADIANS(T99))","v":-0.9052509880952605},{"$f":"COS(RADIANS(Sight2!DEC2_))*SIN(RADIANS(T99))","v":-0.22570442093360704},null,null,null,null,194,{"$f":"COS(RADIANS(Sight2!HC2_))*COS(RADIANS(AA99))","v":-0.92141357070810681},{"$f":"COS(RADIANS(Sight2!HC2_))*SIN(RADIANS(AA99))","v":-0.22973420537725592}]
[196,-0.96126169593831889,-0.275637355816999,null,-106,{"$f":"COS(RADIANS(E100))*COS(RADIANS(Sight2!LHA2_))","v":-0.24981192241234015},-0.96126169593831889,{"$f":"F100*COS(RADIANS(90-Sight2!LAT2_))-G100*SIN(RADIANS(90-Sight2!LAT2_))","v":0.47287802605596352},{"$f":"F100*SIN(RADIANS(90-Sight2!LAT2_))+G100*COS(RADIANS(90-Sight2!LAT2_))","v":-0.87339362095848716},null,{"$f":"COS(RADIANS(E100))*COS(RADIANS(Sight2!AZ_nord2-180))","v":-0.25075462987129205},null,305,0.8191520442889918,0.57357643635104605,null,null,null,null,196,{"$f":"COS(RADIANS(Sight2!DEC2_))*COS(RADIANS(T100))","v":-0.89682256295826368},{"$f":"COS(RADIANS(Sight2!DEC2_))*SIN(RADIANS(T100))","v":-0.25715973177266993},null,null,null,null,196,{"$f":"COS(RADIANS(Sight2!HC2_))*COS(RADIANS(AA100))","v":-0.91283466231357768},{"$f":"COS(RADIANS(Sight2!HC2_))*SIN(RADIANS(AA100))","v":-0.26175112737911782}]
[198,-0.95105651629515364,-0.30901699437494728,null,-108,{"$f":"COS(RADIANS(E101))*COS(RADIANS(Sight2!LHA2_))","v":-0.28006410522288167},-0.95105651629515364,{"$f":"F101*COS(RADIANS(90-Sight2!LAT2_))-G101*SIN(RADIANS(90-Sight2!LAT2_))","v":0.44379306439463229},{"$f":"F101*SIN(RADIANS(90-Sight2!LAT2_))+G101*COS(RADIANS(90-Sight2!LAT2_))","v":-0.88656196411586985},null,{"$f":"COS(RADIANS(E101))*COS(RADIANS(Sight2!AZ_nord2-180))","v":-0.28112097440041639},null,310,0.76604444311897812,0.64278760968653914,null,null,null,null,198,{"$f":"COS(RADIANS(Sight2!DEC2_))*COS(RADIANS(T101))","v":-0.88730149767322786},{"$f":"COS(RADIANS(Sight2!DEC2_))*SIN(RADIANS(T101))","v":-0.28830173309098789},null,null,null,null,198,{"$f":"COS(RADIANS(Sight2!HC2_))*COS(RADIANS(AA101))","v":-0.90314360549441997},{"$f":"COS(RADIANS(Sight2!HC2_))*SIN(RADIANS(AA101))","v":-0.29344914595193855}]
[200,-0.93969262078590843,-0.34202014332566866,null,-110,{"$f":"COS(RADIANS(E102))*COS(RADIANS(Sight2!LHA2_))","v":-0.30997507306177741},-0.93969262078590843,{"$f":"F102*COS(RADIANS(90-Sight2!LAT2_))-G102*SIN(RADIANS(90-Sight2!LAT2_))","v":0.41416740924541706},{"$f":"F102*SIN(RADIANS(90-Sight2!LAT2_))+G102*COS(RADIANS(90-Sight2!LAT2_))","v":-0.89865016808437892},null,{"$f":"COS(RADIANS(E102))*COS(RADIANS(Sight2!AZ_nord2-180))","v":-0.31114481632560037},null,315,0.70710678118654768,0.70710678118654735,null,null,null,null,200,{"$f":"COS(RADIANS(Sight2!DEC2_))*COS(RADIANS(T102))","v":-0.87669939219159521},{"$f":"COS(RADIANS(Sight2!DEC2_))*SIN(RADIANS(T102))","v":-0.31909248315701205},null,null,null,null,200,{"$f":"COS(RADIANS(Sight2!HC2_))*COS(RADIANS(AA102))","v":-0.89235220731057485},{"$f":"COS(RADIANS(Sight2!HC2_))*SIN(RADIANS(AA102))","v":-0.32478964194279264}]
[202,-0.92718385456678742,-0.37460659341591201,null,-112,{"$f":"COS(RADIANS(E103))*COS(RADIANS(Sight2!LHA2_))","v":-0.33950838402214695},-0.92718385456678742,{"$f":"F103*COS(RADIANS(90-Sight2!LAT2_))-G103*SIN(RADIANS(90-Sight2!LAT2_))","v":0.38403715490563517},{"$f":"F103*SIN(RADIANS(90-Sight2!LAT2_))+G103*COS(RADIANS(90-Sight2!LAT2_))","v":-0.90964350524952375},null,{"$f":"COS(RADIANS(E103))*COS(RADIANS(Sight2!AZ_nord2-180))","v":-0.34078957622027634},null,320,0.64278760968653958,0.76604444311897779,null,null,null,null,202,{"$f":"COS(RADIANS(Sight2!DEC2_))*COS(RADIANS(T103))","v":-0.86502916354576587},{"$f":"COS(RADIANS(Sight2!DEC2_))*SIN(RADIANS(T103))","v":-0.34949446818473834},null,null,null,null,202,{"$f":"COS(RADIANS(Sight2!HC2_))*COS(RADIANS(AA103))","v":-0.88047361541844193},{"$f":"COS(RADIANS(Sight2!HC2_))*SIN(RADIANS(AA103))","v":-0.3557344317849484}]
[204,-0.91354545764260087,-0.40673664307580021,null,-114,{"$f":"COS(RADIANS(E104))*COS(RADIANS(Sight2!LHA2_))","v":-0.36862805631384299},-0.91354545764260087,{"$f":"F104*COS(RADIANS(90-Sight2!LAT2_))-G104*SIN(RADIANS(90-Sight2!LAT2_))","v":0.3534390104489894},{"$f":"F104*SIN(RADIANS(90-Sight2!LAT2_))+G104*COS(RADIANS(90-Sight2!LAT2_))","v":-0.91952858192336251},null,{"$f":"COS(RADIANS(E104))*COS(RADIANS(Sight2!AZ_nord2-180))","v":-0.37001913651093787},null,325,{"$f":"COS(RADIANS(90+M104))","v":0.57357643635104649},{"$f":"SIN(RADIANS(90+M104))","v":0.81915204428899147},null,null,null,null,204,{"$f":"COS(RADIANS(Sight2!DEC2_))*COS(RADIANS(T104))","v":-0.8523050301116839},{"$f":"COS(RADIANS(Sight2!DEC2_))*SIN(RADIANS(T104))","v":-0.37947064803847735},null,null,null,null,204,{"$f":"COS(RADIANS(Sight2!HC2_))*COS(RADIANS(AA104))","v":-0.86752230205248504},{"$f":"COS(RADIANS(Sight2!HC2_))*SIN(RADIANS(AA104))","v":-0.38624581401866276}]
[206,-0.89879404629916693,-0.43837114678907746,null,-116,{"$f":"COS(RADIANS(E105))*COS(RADIANS(Sight2!LHA2_))","v":-0.39729861210171974},-0.89879404629916693,{"$f":"F105*COS(RADIANS(90-Sight2!LAT2_))-G105*SIN(RADIANS(90-Sight2!LAT2_))","v":0.32241025500121751},{"$f":"F105*SIN(RADIANS(90-Sight2!LAT2_))+G105*COS(RADIANS(90-Sight2!LAT2_))","v":-0.9282933546626474},null,{"$f":"COS(RADIANS(E105))*COS(RADIANS(Sight2!AZ_nord2-180))","v":-0.39879788548083944},null,{"$f":"SUM(M104+5)","v":330},0.49999999999999972,0.86602540378443882,null,null,null,null,206,{"$f":"COS(RADIANS(Sight2!DEC2_))*COS(RADIANS(T105))","v":-0.8385424942859363},{"$f":"COS(RADIANS(Sight2!DEC2_))*SIN(RADIANS(T105))","v":-0.40898450136055381},null,null,null,null,206,{"$f":"COS(RADIANS(Sight2!HC2_))*COS(RADIANS(AA105))","v":-0.85351404639304362},{"$f":"COS(RADIANS(Sight2!HC2_))*SIN(RADIANS(AA105))","v":-0.41628661522460197}]
[208,-0.88294759285892688,-0.46947156278589086,null,-118,{"$f":"COS(RADIANS(E106))*COS(RADIANS(Sight2!LHA2_))","v":-0.42548512072991024},-0.88294759285892688,{"$f":"F106*COS(RADIANS(90-Sight2!LAT2_))-G106*SIN(RADIANS(90-Sight2!LAT2_))","v":0.29098869232121927},{"$f":"F106*SIN(RADIANS(90-Sight2!LAT2_))+G106*COS(RADIANS(90-Sight2!LAT2_))","v":-0.93592714494190543},null,{"$f":"COS(RADIANS(E106))*COS(RADIANS(Sight2!AZ_nord2-180))","v":-0.4270907606573876},null,335,0.42261826174069927,0.90630778703665005,null,null,null,null,208,{"$f":"COS(RADIANS(Sight2!DEC2_))*COS(RADIANS(T106))","v":-0.82375832359847057},{"$f":"COS(RADIANS(Sight2!DEC2_))*SIN(RADIANS(T106))","v":-0.4380000700669554},null,null,null,null,208,{"$f":"COS(RADIANS(Sight2!HC2_))*COS(RADIANS(AA106))","v":-0.83846591534183246},{"$f":"COS(RADIANS(Sight2!HC2_))*SIN(RADIANS(AA106))","v":-0.44582023531392739}]
[210,-0.8660254037844386,-0.50000000000000011,null,-120,{"$f":"COS(RADIANS(E107))*COS(RADIANS(Sight2!LHA2_))","v":-0.45315324127944939},-0.86602540378443871,{"$f":"F107*COS(RADIANS(90-Sight2!LAT2_))-G107*SIN(RADIANS(90-Sight2!LAT2_))","v":0.25921260474299984},{"$f":"F107*SIN(RADIANS(90-Sight2!LAT2_))+G107*COS(RADIANS(90-Sight2!LAT2_))","v":-0.94242065216357607},null,{"$f":"COS(RADIANS(E107))*COS(RADIANS(Sight2!AZ_nord2-180))","v":-0.45486329153036276},null,340,0.34202014332566866,0.93969262078590843,null,null,null,null,210,{"$f":"COS(RADIANS(Sight2!DEC2_))*COS(RADIANS(T107))","v":-0.8079705302839425},{"$f":"COS(RADIANS(Sight2!DEC2_))*SIN(RADIANS(T107))","v":-0.46648200315671901},null,null,null,null,210,{"$f":"COS(RADIANS(Sight2!HC2_))*COS(RADIANS(AA107))","v":-0.82239624272855039},{"$f":"COS(RADIANS(Sight2!HC2_))*SIN(RADIANS(AA107))","v":-0.47481069211986554}]
[212,-0.84804809615642607,-0.52991926423320479,null,-122,{"$f":"COS(RADIANS(E108))*COS(RADIANS(Sight2!LHA2_))","v":-0.4802692644073957},-0.84804809615642607,{"$f":"F108*COS(RADIANS(90-Sight2!LAT2_))-G108*SIN(RADIANS(90-Sight2!LAT2_))","v":0.22712070653454169},{"$f":"F108*SIN(RADIANS(90-Sight2!LAT2_))+G108*COS(RADIANS(90-Sight2!LAT2_))","v":-0.94776596498935872},null,{"$f":"COS(RADIANS(E108))*COS(RADIANS(Sight2!AZ_nord2-180))","v":-0.48208164154892735},null,345,0.25881904510252074,0.96592582628906831,null,null,null,null,212,{"$f":"COS(RADIANS(Sight2!DEC2_))*COS(RADIANS(T108))","v":-0.79119834933658284},{"$f":"COS(RADIANS(Sight2!DEC2_))*SIN(RADIANS(T108))","v":-0.49439559978167996},null,null,null,null,212,{"$f":"COS(RADIANS(Sight2!HC2_))*COS(RADIANS(AA108))","v":-0.80532460697393371},{"$f":"COS(RADIANS(Sight2!HC2_))*SIN(RADIANS(AA108))","v":-0.50322266523643566}]
[214,-0.82903757255504185,-0.55919290347074668,null,-124,{"$f":"COS(RADIANS(E109))*COS(RADIANS(Sight2!LHA2_))","v":-0.50680015341647044},-0.82903757255504174,{"$f":"F109*COS(RADIANS(90-Sight2!LAT2_))-G109*SIN(RADIANS(90-Sight2!LAT2_))","v":0.19475209673043392},{"$f":"F109*SIN(RADIANS(90-Sight2!LAT2_))+G109*COS(RADIANS(90-Sight2!LAT2_))","v":-0.95195657097895692},null,{"$f":"COS(RADIANS(E109))*COS(RADIANS(Sight2!AZ_nord2-180))","v":-0.50871264934624871},null,350,0.17364817766693044,0.98480775301220802,null,null,null,null,214,{"$f":"COS(RADIANS(Sight2!DEC2_))*COS(RADIANS(T109))","v":-0.7734622150753192},{"$f":"COS(RADIANS(Sight2!DEC2_))*SIN(RADIANS(T109))","v":-0.52170685152411134},null,null,null,null,214,{"$f":"COS(RADIANS(Sight2!HC2_))*COS(RADIANS(AA109))","v":-0.78727180723646517},{"$f":"COS(RADIANS(Sight2!HC2_))*SIN(RADIANS(AA109))","v":-0.53102153905092464}]
[216,-0.80901699437494756,-0.58778525229247303,null,-126,{"$f":"COS(RADIANS(E110))*COS(RADIANS(Sight2!LHA2_))","v":-0.53271358450518635},-0.80901699437494745,{"$f":"F110*COS(RADIANS(90-Sight2!LAT2_))-G110*SIN(RADIANS(90-Sight2!LAT2_))","v":0.16214621149572089},{"$f":"F110*SIN(RADIANS(90-Sight2!LAT2_))+G110*COS(RADIANS(90-Sight2!LAT2_))","v":-0.95498736452448574},null,{"$f":"COS(RADIANS(E110))*COS(RADIANS(Sight2!AZ_nord2-180))","v":-0.53472386914151826},null,355,8.7155742747658374E-2,0.99619469809174555,null,null,null,null,216,{"$f":"COS(RADIANS(Sight2!DEC2_))*COS(RADIANS(T110))","v":-0.754783736247707},{"$f":"COS(RADIANS(Sight2!DEC2_))*SIN(RADIANS(T110))","v":-0.5483824838307404},null,null,null,null,216,{"$f":"COS(RADIANS(Sight2!HC2_))*COS(RADIANS(AA110))","v":-0.76825983807180431},{"$f":"COS(RADIANS(Sight2!HC2_))*SIN(RADIANS(AA110))","v":-0.55817344491767762}]
[218,-0.78801075360672201,-0.61566147532565818,null,-128,{"$f":"COS(RADIANS(E111))*COS(RADIANS(Sight2!LHA2_))","v":-0.55797798614941985},-0.78801075360672201,{"$f":"F111*COS(RADIANS(90-Sight2!LAT2_))-G111*SIN(RADIANS(90-Sight2!LAT2_))","v":0.12934277607900951},{"$f":"F111*SIN(RADIANS(90-Sight2!LAT2_))+G111*COS(RADIANS(90-Sight2!LAT2_))","v":-0.95685465307086814},null,{"$f":"COS(RADIANS(E111))*COS(RADIANS(Sight2!AZ_nord2-180))","v":-0.56008361027013653},null,null,null,null,null,null,null,null,218,{"$f":"COS(RADIANS(Sight2!DEC2_))*COS(RADIANS(T111))","v":-0.7351856697029987},{"$f":"COS(RADIANS(Sight2!DEC2_))*SIN(RADIANS(T111))","v":-0.57438999655266776},null,null,null,null,218,{"$f":"COS(RADIANS(Sight2!HC2_))*COS(RADIANS(AA111))","v":-0.74831186263580884},{"$f":"COS(RADIANS(Sight2!HC2_))*SIN(RADIANS(AA111))","v":-0.58464530242182644}]
[220,-0.76604444311897801,-0.64278760968653925,null,-130,{"$f":"COS(RADIANS(E112))*COS(RADIANS(Sight2!LHA2_))","v":-0.58256257756745011},-0.76604444311897801,{"$f":"F112*COS(RADIANS(90-Sight2!LAT2_))-G112*SIN(RADIANS(90-Sight2!LAT2_))","v":9.6381756413373154E-2},{"$f":"F112*SIN(RADIANS(90-Sight2!LAT2_))+G112*COS(RADIANS(90-Sight2!LAT2_))","v":-0.95755616161464374},null,{"$f":"COS(RADIANS(E112))*COS(RADIANS(Sight2!AZ_nord2-180))","v":-0.58476097579390707},null,null,null,null,null,null,null,null,220,{"$f":"COS(RADIANS(Sight2!DEC2_))*COS(RADIANS(T112))","v":-0.71469189266642819},{"$f":"COS(RADIANS(Sight2!DEC2_))*SIN(RADIANS(T112))","v":-0.59969770354179197},null,null,null,null,220,{"$f":"COS(RADIANS(Sight2!HC2_))*COS(RADIANS(AA112))","v":-0.72745218446379767},{"$f":"COS(RADIANS(Sight2!HC2_))*SIN(RADIANS(AA112))","v":-0.61040485968267921}]
[222,-0.74314482547739424,-0.66913060635885824,null,-132,{"$f":"COS(RADIANS(E113))*COS(RADIANS(Sight2!LHA2_))","v":-0.60643740622160025},-0.74314482547739424,{"$f":"F113*COS(RADIANS(90-Sight2!LAT2_))-G113*SIN(RADIANS(90-Sight2!LAT2_))","v":6.33033104240186E-2},{"$f":"F113*SIN(RADIANS(90-Sight2!LAT2_))+G113*COS(RADIANS(90-Sight2!LAT2_))","v":-0.95709103547571128},null,{"$f":"COS(RADIANS(E113))*COS(RADIANS(Sight2!AZ_nord2-180))","v":-0.60872590014419581},null,null,null,null,null,null,null,null,222,{"$f":"COS(RADIANS(Sight2!DEC2_))*COS(RADIANS(T113))","v":-0.69332737364849029},{"$f":"COS(RADIANS(Sight2!DEC2_))*SIN(RADIANS(T113))","v":-0.62427477125550024},null,null,null,null,222,{"$f":"COS(RADIANS(Sight2!HC2_))*COS(RADIANS(AA113))","v":-0.7057062178604363},{"$f":"COS(RADIANS(Sight2!HC2_))*SIN(RADIANS(AA113))","v":-0.63542073264766941}]
[224,-0.71933980033865108,-0.69465837045899737,null,-134,{"$f":"COS(RADIANS(E114))*COS(RADIANS(Sight2!LHA2_))","v":-0.62957338431079068},-0.71933980033865108,{"$f":"F114*COS(RADIANS(90-Sight2!LAT2_))-G114*SIN(RADIANS(90-Sight2!LAT2_))","v":3.0147739102039772E-2},{"$f":"F114*SIN(RADIANS(90-Sight2!LAT2_))+G114*COS(RADIANS(90-Sight2!LAT2_))","v":-0.95545984133862394},null,{"$f":"COS(RADIANS(E114))*COS(RADIANS(Sight2!AZ_nord2-180))","v":-0.63194918575219561},null,null,null,null,null,null,null,null,224,{"$f":"COS(RADIANS(Sight2!DEC2_))*COS(RADIANS(T114))","v":-0.67111814202465636},{"$f":"COS(RADIANS(Sight2!DEC2_))*SIN(RADIANS(T114))","v":-0.64809125632259046},null,null,null,null,224,{"$f":"COS(RADIANS(Sight2!HC2_))*COS(RADIANS(AA114))","v":-0.68310045693632149},{"$f":"COS(RADIANS(Sight2!HC2_))*SIN(RADIANS(AA114))","v":-0.65966244332898882}]
[226,-0.69465837045899725,-0.71933980033865119,null,-136,{"$f":"COS(RADIANS(E115))*COS(RADIANS(Sight2!LHA2_))","v":-0.65194232420954379},-0.69465837045899714,{"$f":"F115*COS(RADIANS(90-Sight2!LAT2_))-G115*SIN(RADIANS(90-Sight2!LAT2_))","v":-3.0445625961315614E-3},{"$f":"F115*SIN(RADIANS(90-Sight2!LAT2_))+G115*COS(RADIANS(90-Sight2!LAT2_))","v":-0.95266456656217113},null,{"$f":"COS(RADIANS(E115))*COS(RADIANS(Sight2!AZ_nord2-180))","v":-0.65440253862166597},null,null,null,null,null,null,null,null,226,{"$f":"COS(RADIANS(Sight2!DEC2_))*COS(RADIANS(T115))","v":-0.64809125632259035},{"$f":"COS(RADIANS(Sight2!DEC2_))*SIN(RADIANS(T115))","v":-0.67111814202465647},null,null,null,null,226,{"$f":"COS(RADIANS(Sight2!HC2_))*COS(RADIANS(AA115))","v":-0.65966244332898871},{"$f":"COS(RADIANS(Sight2!HC2_))*SIN(RADIANS(AA115))","v":-0.6831004569363216}]
[228,-0.66913060635885813,-0.74314482547739436,null,-138,{"$f":"COS(RADIANS(E116))*COS(RADIANS(Sight2!LHA2_))","v":-0.67351697281026401},-0.66913060635885835,{"$f":"F116*COS(RADIANS(90-Sight2!LAT2_))-G116*SIN(RADIANS(90-Sight2!LAT2_))","v":-3.6233154963758174E-2},{"$f":"F116*SIN(RADIANS(90-Sight2!LAT2_))+G116*COS(RADIANS(90-Sight2!LAT2_))","v":-0.94870861675808948},null,{"$f":"COS(RADIANS(E116))*COS(RADIANS(Sight2!AZ_nord2-180))","v":-0.67605860280080921},null,null,null,null,null,null,null,null,228,{"$f":"COS(RADIANS(Sight2!DEC2_))*COS(RADIANS(T116))","v":-0.62427477125550013},{"$f":"COS(RADIANS(Sight2!DEC2_))*SIN(RADIANS(T116))","v":-0.6933273736484904},null,null,null,null,228,{"$f":"COS(RADIANS(Sight2!HC2_))*COS(RADIANS(AA116))","v":-0.6354207326476693},{"$f":"COS(RADIANS(Sight2!HC2_))*SIN(RADIANS(AA116))","v":-0.70570621786043641}]
[230,-0.64278760968653947,-0.7660444431189779,null,-140,{"$f":"COS(RADIANS(E117))*COS(RADIANS(Sight2!LHA2_))","v":-0.69427104472695167},-0.64278760968653947,{"$f":"F117*COS(RADIANS(90-Sight2!LAT2_))-G117*SIN(RADIANS(90-Sight2!LAT2_))","v":-6.937760281335148E-2},{"$f":"F117*SIN(RADIANS(90-Sight2!LAT2_))+G117*COS(RADIANS(90-Sight2!LAT2_))","v":-0.94359681164184772},null,{"$f":"COS(RADIANS(E117))*COS(RADIANS(Sight2!AZ_nord2-180))","v":-0.69689099371128438},null,null,null,null,null,null,null,null,230,{"$f":"COS(RADIANS(Sight2!DEC2_))*COS(RADIANS(T117))","v":-0.59969770354179219},{"$f":"COS(RADIANS(Sight2!DEC2_))*SIN(RADIANS(T117))","v":-0.71469189266642807},null,null,null,null,230,{"$f":"COS(RADIANS(Sight2!HC2_))*COS(RADIANS(AA117))","v":-0.61040485968267943},{"$f":"COS(RADIANS(Sight2!HC2_))*SIN(RADIANS(AA117))","v":-0.72745218446379756}]
[232,-0.61566147532565807,-0.78801075360672213,null,-142,{"$f":"COS(RADIANS(E118))*COS(RADIANS(Sight2!LHA2_))","v":-0.7141792543198956},-0.6156614753256584,{"$f":"F118*COS(RADIANS(90-Sight2!LAT2_))-G118*SIN(RADIANS(90-Sight2!LAT2_))","v":-0.10243752474071721},{"$f":"F118*SIN(RADIANS(90-Sight2!LAT2_))+G118*COS(RADIANS(90-Sight2!LAT2_))","v":-0.93733537916056675},null,{"$f":"COS(RADIANS(E118))*COS(RADIANS(Sight2!AZ_nord2-180))","v":-0.71687433029375081},null,null,null,null,null,null,null,null,232,{"$f":"COS(RADIANS(Sight2!DEC2_))*COS(RADIANS(T118))","v":-0.57438999655266765},{"$f":"COS(RADIANS(Sight2!DEC2_))*SIN(RADIANS(T118))","v":-0.73518566970299881},null,null,null,null,232,{"$f":"COS(RADIANS(Sight2!HC2_))*COS(RADIANS(AA118))","v":-0.58464530242182633},{"$f":"COS(RADIANS(Sight2!HC2_))*SIN(RADIANS(AA118))","v":-0.74831186263580896}]
[234,-0.58778525229247325,-0.80901699437494734,null,-144,{"$f":"COS(RADIANS(E119))*COS(RADIANS(Sight2!LHA2_))","v":-0.73321734650233128},-0.58778525229247325,{"$f":"F119*COS(RADIANS(90-Sight2!LAT2_))-G119*SIN(RADIANS(90-Sight2!LAT2_))","v":-0.13537264232347718},{"$f":"F119*SIN(RADIANS(90-Sight2!LAT2_))+G119*COS(RADIANS(90-Sight2!LAT2_))","v":-0.92993194790522504},null,{"$f":"COS(RADIANS(E119))*COS(RADIANS(Sight2!AZ_nord2-180))","v":-0.73598426593077937},null,null,null,null,null,null,null,null,234,{"$f":"COS(RADIANS(Sight2!DEC2_))*COS(RADIANS(T119))","v":-0.54838248383074062},{"$f":"COS(RADIANS(Sight2!DEC2_))*SIN(RADIANS(T119))","v":-0.75478373624770678},null,null,null,null,234,{"$f":"COS(RADIANS(Sight2!HC2_))*COS(RADIANS(AA119))","v":-0.55817344491767784},{"$f":"COS(RADIANS(Sight2!HC2_))*SIN(RADIANS(AA119))","v":-0.76825983807180409}]
[236,-0.55919290347074657,-0.82903757255504185,null,-146,{"$f":"COS(RADIANS(E120))*COS(RADIANS(Sight2!LHA2_))","v":-0.75136212629152799},-0.5591929034707469,{"$f":"F120*COS(RADIANS(90-Sight2!LAT2_))-G120*SIN(RADIANS(90-Sight2!LAT2_))","v":-0.16814282919412321},{"$f":"F120*SIN(RADIANS(90-Sight2!LAT2_))+G120*COS(RADIANS(90-Sight2!LAT2_))","v":-0.92139553781639616},null,{"$f":"COS(RADIANS(E120))*COS(RADIANS(Sight2!AZ_nord2-180))","v":-0.75419751810945668},null,null,null,null,null,null,null,null,236,{"$f":"COS(RADIANS(Sight2!DEC2_))*COS(RADIANS(T120))","v":-0.52170685152411123},{"$f":"COS(RADIANS(Sight2!DEC2_))*SIN(RADIANS(T120))","v":-0.7734622150753192},null,null,null,null,236,{"$f":"COS(RADIANS(Sight2!HC2_))*COS(RADIANS(AA120))","v":-0.53102153905092453},{"$f":"COS(RADIANS(Sight2!HC2_))*SIN(RADIANS(AA120))","v":-0.78727180723646517}]
[238,-0.52991926423320501,-0.84804809615642596,null,-148,{"$f":"COS(RADIANS(E121))*COS(RADIANS(Sight2!LHA2_))","v":-0.7685914870683016},-0.5299192642332049,{"$f":"F121*COS(RADIANS(90-Sight2!LAT2_))-G121*SIN(RADIANS(90-Sight2!LAT2_))","v":-0.2007081599278136},{"$f":"F121*SIN(RADIANS(90-Sight2!LAT2_))+G121*COS(RADIANS(90-Sight2!LAT2_))","v":-0.91173654919484037},null,{"$f":"COS(RADIANS(E121))*COS(RADIANS(Sight2!AZ_nord2-180))","v":-0.77149189678753938},null,null,null,null,null,null,null,null,238,{"$f":"COS(RADIANS(Sight2!DEC2_))*COS(RADIANS(T121))","v":-0.49439559978168018},{"$f":"COS(RADIANS(Sight2!DEC2_))*SIN(RADIANS(T121))","v":-0.79119834933658273},null,null,null,null,238,{"$f":"COS(RADIANS(Sight2!HC2_))*COS(RADIANS(AA121))","v":-0.50322266523643588},{"$f":"COS(RADIANS(Sight2!HC2_))*SIN(RADIANS(AA121))","v":-0.8053246069739336}]
[240,-0.50000000000000044,-0.86602540378443837,null,-150,{"$f":"COS(RADIANS(E122))*COS(RADIANS(Sight2!LHA2_))","v":-0.78488443751052506},-0.49999999999999994,{"$f":"F122*COS(RADIANS(90-Sight2!LAT2_))-G122*SIN(RADIANS(90-Sight2!LAT2_))","v":-0.23302895868535378},{"$f":"F122*SIN(RADIANS(90-Sight2!LAT2_))+G122*COS(RADIANS(90-Sight2!LAT2_))","v":-0.90096675003033977},null,{"$f":"COS(RADIANS(E122))*COS(RADIANS(Sight2!AZ_nord2-180))","v":-0.78784633142860294},null,null,null,null,null,null,null,null,240,{"$f":"COS(RADIANS(Sight2!DEC2_))*COS(RADIANS(T122))","v":-0.46648200315671928},{"$f":"COS(RADIANS(Sight2!DEC2_))*SIN(RADIANS(T122))","v":-0.80797053028394228},null,null,null,null,240,{"$f":"COS(RADIANS(Sight2!HC2_))*COS(RADIANS(AA122))","v":-0.47481069211986587},{"$f":"COS(RADIANS(Sight2!HC2_))*SIN(RADIANS(AA122))","v":-0.82239624272855028}]
[242,-0.46947156278589075,-0.88294759285892699,null,-152,{"$f":"COS(RADIANS(E123))*COS(RADIANS(Sight2!LHA2_))","v":-0.80022112716782112},-0.46947156278589069,{"$f":"F123*COS(RADIANS(90-Sight2!LAT2_))-G123*SIN(RADIANS(90-Sight2!LAT2_))","v":-0.26506584755209517},{"$f":"F123*SIN(RADIANS(90-Sight2!LAT2_))+G123*COS(RADIANS(90-Sight2!LAT2_))","v":-0.88909926166421593},null,{"$f":"COS(RADIANS(E123))*COS(RADIANS(Sight2!AZ_nord2-180))","v":-0.80324089667324472},null,null,null,null,null,null,null,null,242,{"$f":"COS(RADIANS(Sight2!DEC2_))*COS(RADIANS(T123))","v":-0.43800007006695529},{"$f":"COS(RADIANS(Sight2!DEC2_))*SIN(RADIANS(T123))","v":-0.82375832359847068},null,null,null,null,242,{"$f":"COS(RADIANS(Sight2!HC2_))*COS(RADIANS(AA123))","v":-0.44582023531392728},{"$f":"COS(RADIANS(Sight2!HC2_))*SIN(RADIANS(AA123))","v":-0.83846591534183257}]
[244,-0.43837114678907774,-0.89879404629916682,null,-154,{"$f":"COS(RADIANS(E124))*COS(RADIANS(Sight2!LHA2_))","v":-0.81458287064627855},-0.43837114678907729,{"$f":"F124*COS(RADIANS(90-Sight2!LAT2_))-G124*SIN(RADIANS(90-Sight2!LAT2_))","v":-0.29677979451385816},{"$f":"F124*SIN(RADIANS(90-Sight2!LAT2_))+G124*COS(RADIANS(90-Sight2!LAT2_))","v":-0.8761485428029967},null,{"$f":"COS(RADIANS(E124))*COS(RADIANS(Sight2!AZ_nord2-180))","v":-0.81765683661506516},null,null,null,null,null,null,null,null,244,{"$f":"COS(RADIANS(Sight2!DEC2_))*COS(RADIANS(T124))","v":-0.40898450136055409},{"$f":"COS(RADIANS(Sight2!DEC2_))*SIN(RADIANS(T124))","v":-0.83854249428593619},null,null,null,null,244,{"$f":"COS(RADIANS(Sight2!HC2_))*COS(RADIANS(AA124))","v":-0.41628661522460225},{"$f":"COS(RADIANS(Sight2!HC2_))*SIN(RADIANS(AA124))","v":-0.85351404639304351}]
[246,-0.4067366430758001,-0.91354545764260098,null,-156,{"$f":"COS(RADIANS(E125))*COS(RADIANS(Sight2!LHA2_))","v":-0.82795217037372537},-0.40673664307580043,{"$f":"F125*COS(RADIANS(90-Sight2!LAT2_))-G125*SIN(RADIANS(90-Sight2!LAT2_))","v":-0.3281321610114285},{"$f":"F125*SIN(RADIANS(90-Sight2!LAT2_))+G125*COS(RADIANS(90-Sight2!LAT2_))","v":-0.86213037190270903},null,{"$f":"COS(RADIANS(E125))*COS(RADIANS(Sight2!AZ_nord2-180))","v":-0.83107658765185033},null,null,null,null,null,null,null,null,246,{"$f":"COS(RADIANS(Sight2!DEC2_))*COS(RADIANS(T125))","v":-0.37947064803847724},{"$f":"COS(RADIANS(Sight2!DEC2_))*SIN(RADIANS(T125))","v":-0.85230503011168401},null,null,null,null,246,{"$f":"COS(RADIANS(Sight2!HC2_))*COS(RADIANS(AA125))","v":-0.38624581401866265},{"$f":"COS(RADIANS(Sight2!HC2_))*SIN(RADIANS(AA125))","v":-0.86752230205248515}]
[248,-0.37460659341591229,-0.92718385456678731,null,-158,{"$f":"COS(RADIANS(E126))*COS(RADIANS(Sight2!LHA2_))","v":-0.84031273791782701},-0.37460659341591224,{"$f":"F126*COS(RADIANS(90-Sight2!LAT2_))-G126*SIN(RADIANS(90-Sight2!LAT2_))","v":-0.35908474901569132},{"$f":"F126*SIN(RADIANS(90-Sight2!LAT2_))+G126*COS(RADIANS(90-Sight2!LAT2_))","v":-0.84706182794526108},null,{"$f":"COS(RADIANS(E126))*COS(RADIANS(Sight2!AZ_nord2-180))","v":-0.84348379988411648},null,null,null,null,null,null,null,null,248,{"$f":"COS(RADIANS(Sight2!DEC2_))*COS(RADIANS(T126))","v":-0.34949446818473862},{"$f":"COS(RADIANS(Sight2!DEC2_))*SIN(RADIANS(T126))","v":-0.86502916354576576},null,null,null,null,248,{"$f":"COS(RADIANS(Sight2!HC2_))*COS(RADIANS(AA126))","v":-0.35573443178494868},{"$f":"COS(RADIANS(Sight2!HC2_))*SIN(RADIANS(AA126))","v":-0.88047361541844182}]
[250,-0.34202014332566855,-0.93969262078590843,null,-160,{"$f":"COS(RADIANS(E127))*COS(RADIANS(Sight2!LHA2_))","v":-0.85164951383103016},-0.34202014332566888,{"$f":"F127*COS(RADIANS(90-Sight2!LAT2_))-G127*SIN(RADIANS(90-Sight2!LAT2_))","v":-0.38959984756604393},{"$f":"F127*SIN(RADIANS(90-Sight2!LAT2_))+G127*COS(RADIANS(90-Sight2!LAT2_))","v":-0.8309612696303339},null,{"$f":"COS(RADIANS(E127))*COS(RADIANS(Sight2!AZ_nord2-180))","v":-0.85486335703494287},null,null,null,null,null,null,null,null,250,{"$f":"COS(RADIANS(Sight2!DEC2_))*COS(RADIANS(T127))","v":-0.31909248315701194},{"$f":"COS(RADIANS(Sight2!DEC2_))*SIN(RADIANS(T127))","v":-0.87669939219159521},null,null,null,null,250,{"$f":"COS(RADIANS(Sight2!HC2_))*COS(RADIANS(AA127))","v":-0.32478964194279253},{"$f":"COS(RADIANS(Sight2!HC2_))*SIN(RADIANS(AA127))","v":-0.89235220731057485}]
[252,-0.30901699437494756,-0.95105651629515353,null,-162,{"$f":"COS(RADIANS(E128))*COS(RADIANS(Sight2!LHA2_))","v":-0.86194868599818097},-0.30901699437494751,{"$f":"F128*COS(RADIANS(90-Sight2!LAT2_))-G128*SIN(RADIANS(90-Sight2!LAT2_))","v":-0.41964027871539322},{"$f":"F128*SIN(RADIANS(90-Sight2!LAT2_))+G128*COS(RADIANS(90-Sight2!LAT2_))","v":-0.8138483130081331},null,{"$f":"COS(RADIANS(E128))*COS(RADIANS(Sight2!AZ_nord2-180))","v":-0.86520139486682768},null,null,null,null,null,null,null,null,252,{"$f":"COS(RADIANS(Sight2!DEC2_))*COS(RADIANS(T128))","v":-0.28830173309098817},{"$f":"COS(RADIANS(Sight2!DEC2_))*SIN(RADIANS(T128))","v":-0.88730149767322775},null,null,null,null,252,{"$f":"COS(RADIANS(Sight2!HC2_))*COS(RADIANS(AA128))","v":-0.29344914595193883},{"$f":"COS(RADIANS(Sight2!HC2_))*SIN(RADIANS(AA128))","v":-0.90314360549441985}]
[254,-0.27563735581699889,-0.96126169593831901,null,-164,{"$f":"COS(RADIANS(E129))*COS(RADIANS(Sight2!LHA2_))","v":-0.87119770646445993},-0.27563735581699922,{"$f":"F129*COS(RADIANS(90-Sight2!LAT2_))-G129*SIN(RADIANS(90-Sight2!LAT2_))","v":-0.44916944282575744},{"$f":"F129*SIN(RADIANS(90-Sight2!LAT2_))+G129*COS(RADIANS(90-Sight2!LAT2_))","v":-0.79574380758025443},null,{"$f":"COS(RADIANS(E129))*COS(RADIANS(Sight2!AZ_nord2-180))","v":-0.87448531807312535},null,null,null,null,null,null,null,null,254,{"$f":"COS(RADIANS(Sight2!DEC2_))*COS(RADIANS(T129))","v":-0.25715973177266982},{"$f":"COS(RADIANS(Sight2!DEC2_))*SIN(RADIANS(T129))","v":-0.89682256295826379},null,null,null,null,254,{"$f":"COS(RADIANS(Sight2!HC2_))*COS(RADIANS(AA129))","v":-0.26175112737911771},{"$f":"COS(RADIANS(Sight2!HC2_))*SIN(RADIANS(AA129))","v":-0.91283466231357779}]
[256,{"$f":"COS(RADIANS(A130))","v":-0.24192189559966779},{"$f":"SIN(RADIANS(A130))","v":-0.97029572627599647},null,-166,{"$f":"COS(RADIANS(E130))*COS(RADIANS(Sight2!LHA2_))","v":-0.87938530672313087},-0.24192189559966773,{"$f":"F130*COS(RADIANS(90-Sight2!LAT2_))-G130*SIN(RADIANS(90-Sight2!LAT2_))","v":-0.47815136315928697},{"$f":"F130*SIN(RADIANS(90-Sight2!LAT2_))+G130*COS(RADIANS(90-Sight2!LAT2_))","v":-0.77666981089777598},null,{"$f":"COS(RADIANS(E130))*COS(RADIANS(Sight2!AZ_nord2-180))","v":-0.88270381562348776},null,null,null,null,null,null,null,null,256,{"$f":"COS(RADIANS(Sight2!DEC2_))*COS(RADIANS(T130))","v":-0.22570442093360729},{"$f":"COS(RADIANS(Sight2!DEC2_))*SIN(RADIANS(T130))","v":-0.9052509880952605},null,null,null,null,256,{"$f":"COS(RADIANS(Sight2!HC2_))*COS(RADIANS(AA130))","v":-0.22973420537725617},{"$f":"COS(RADIANS(Sight2!HC2_))*SIN(RADIANS(AA130))","v":-0.92141357070810681}]
[{"$f":"SUM(A130+2)","v":258},-0.20791169081775979,-0.97814760073380558,null,{"$f":"SUM(E130-2)","v":-168},{"$f":"COS(RADIANS(E131))*COS(RADIANS(Sight2!LHA2_))","v":-0.88650151144448197},{"$f":"SIN(RADIANS(E131))","v":-0.20791169081775931},{"$f":"F131*COS(RADIANS(90-Sight2!LAT2_))-G131*SIN(RADIANS(90-Sight2!LAT2_))","v":-0.50655072971037818},{"$f":"F131*SIN(RADIANS(90-Sight2!LAT2_))+G131*COS(RADIANS(90-Sight2!LAT2_))","v":-0.75664956168753172},null,{"$f":"COS(RADIANS(E131))*COS(RADIANS(Sight2!AZ_nord2-180))","v":-0.88984687454461231},null,null,null,null,null,null,null,null,258,{"$f":"COS(RADIANS(Sight2!DEC2_))*COS(RADIANS(T131))","v":-0.19397412402473796},{"$f":"COS(RADIANS(Sight2!DEC2_))*SIN(RADIANS(T131))","v":-0.91257650434648818},null,null,null,null,{"$f":"SUM(AA130+2)","v":258},{"$f":"COS(RADIANS(Sight2!HC2_))*COS(RADIANS(AA131))","v":-0.197437387633984},{"$f":"COS(RADIANS(Sight2!HC2_))*SIN(RADIANS(AA131))","v":-0.92886987859960801}]
[260,-0.17364817766693033,-0.98480775301220802,null,-170,{"$f":"COS(RADIANS(E132))*COS(RADIANS(Sight2!LHA2_))","v":-0.89253765062922741},-0.17364817766693028,{"$f":"F132*COS(RADIANS(90-Sight2!LAT2_))-G132*SIN(RADIANS(90-Sight2!LAT2_))","v":-0.53433294222547556},{"$f":"F132*SIN(RADIANS(90-Sight2!LAT2_))+G132*COS(RADIANS(90-Sight2!LAT2_))","v":-0.73570745153930117},null,{"$f":"COS(RADIANS(E132))*COS(RADIANS(Sight2!AZ_nord2-180))","v":-0.89590579211950738},null,null,null,null,null,null,null,null,260,{"$f":"COS(RADIANS(Sight2!DEC2_))*COS(RADIANS(T132))","v":-0.16200749952516696},{"$f":"COS(RADIANS(Sight2!DEC2_))*SIN(RADIANS(T132))","v":-0.91879018669880408},null,null,null,null,260,{"$f":"COS(RADIANS(Sight2!HC2_))*COS(RADIANS(AA132))","v":-0.1649000228467771},{"$f":"COS(RADIANS(Sight2!HC2_))*SIN(RADIANS(AA132))","v":-0.93519450162547191}]
[262,-0.13917310096006583,-0.99026806874157025,null,-172,{"$f":"COS(RADIANS(E133))*COS(RADIANS(Sight2!LHA2_))","v":-0.89748637017156685},-0.13917310096006533,{"$f":"F133*COS(RADIANS(90-Sight2!LAT2_))-G133*SIN(RADIANS(90-Sight2!LAT2_))","v":-0.56146415235815139},{"$f":"F133*SIN(RADIANS(90-Sight2!LAT2_))+G133*COS(RADIANS(90-Sight2!LAT2_))","v":-0.7138689951884154},null,{"$f":"COS(RADIANS(E133))*COS(RADIANS(Sight2!AZ_nord2-180))","v":-0.90087318649041292},null,null,null,null,null,null,null,null,262,{"$f":"COS(RADIANS(Sight2!DEC2_))*COS(RADIANS(T133))","v":-0.12984349384276758},{"$f":"COS(RADIANS(Sight2!DEC2_))*SIN(RADIANS(T133))","v":-0.92388446473740615},null,null,null,null,262,{"$f":"COS(RADIANS(Sight2!HC2_))*COS(RADIANS(AA133))","v":-0.13216175278263353},{"$f":"COS(RADIANS(Sight2!HC2_))*SIN(RADIANS(AA133))","v":-0.9403797342067749}]
[264,-0.10452846326765336,-0.9945218953682734,null,-174,{"$f":"COS(RADIANS(E134))*COS(RADIANS(Sight2!LHA2_))","v":-0.90134164081902934},-0.10452846326765373,{"$f":"F134*COS(RADIANS(90-Sight2!LAT2_))-G134*SIN(RADIANS(90-Sight2!LAT2_))","v":-0.58791130490810095},{"$f":"F134*SIN(RADIANS(90-Sight2!LAT2_))+G134*COS(RADIANS(90-Sight2!LAT2_))","v":-0.69116079942998154},null,{"$f":"COS(RADIANS(E134))*COS(RADIANS(Sight2!AZ_nord2-180))","v":-0.90474300565245613},null,null,null,null,null,null,null,null,264,{"$f":"COS(RADIANS(Sight2!DEC2_))*COS(RADIANS(T134))","v":-9.7521293863976899E-2},{"$f":"COS(RADIANS(Sight2!DEC2_))*SIN(RADIANS(T134))","v":-0.92785313186921792},null,null,null,null,264,{"$f":"COS(RADIANS(Sight2!HC2_))*COS(RADIANS(AA134))","v":-9.9262463980680851E-2},{"$f":"COS(RADIANS(Sight2!HC2_))*SIN(RADIANS(AA134))","v":-0.9444192589363406}]
[266,-6.975647374412558E-2,-0.9975640502598242,null,-176,{"$f":"COS(RADIANS(E135))*COS(RADIANS(Sight2!LHA2_))","v":-0.90409876551819024},-6.9756473744125524E-2,{"$f":"F135*COS(RADIANS(90-Sight2!LAT2_))-G135*SIN(RADIANS(90-Sight2!LAT2_))","v":-0.61364217809381449},{"$f":"F135*SIN(RADIANS(90-Sight2!LAT2_))+G135*COS(RADIANS(90-Sight2!LAT2_))","v":-0.66761053070260179},null,{"$f":"COS(RADIANS(E135))*COS(RADIANS(Sight2!AZ_nord2-180))","v":-0.90751053482708821},null,null,null,null,null,null,null,null,266,{"$f":"COS(RADIANS(Sight2!DEC2_))*COS(RADIANS(T135))","v":-6.5080279210617528E-2},{"$f":"COS(RADIANS(Sight2!DEC2_))*SIN(RADIANS(T135))","v":-0.9306913528846652},null,null,null,null,266,{"$f":"COS(RADIANS(Sight2!HC2_))*COS(RADIANS(AA135))","v":-6.624223915657898E-2},{"$f":"COS(RADIANS(Sight2!HC2_))*SIN(RADIANS(AA135))","v":-0.94730815427552673}]
[268,-3.4899496702500761E-2,-0.99939082701909576,null,-178,{"$f":"COS(RADIANS(E136))*COS(RADIANS(Sight2!LHA2_))","v":-0.905754385137306},-3.4899496702501143E-2,{"$f":"F136*COS(RADIANS(90-Sight2!LAT2_))-G136*SIN(RADIANS(90-Sight2!LAT2_))","v":-0.63862542280985213},{"$f":"F136*SIN(RADIANS(90-Sight2!LAT2_))+G136*COS(RADIANS(90-Sight2!LAT2_))","v":-0.64324688138107955},null,{"$f":"COS(RADIANS(E136))*COS(RADIANS(Sight2!AZ_nord2-180))","v":-0.90917240220631501},null,null,null,null,null,null,null,null,268,{"$f":"COS(RADIANS(Sight2!DEC2_))*COS(RADIANS(T136))","v":-3.2559974261887718E-2},{"$f":"COS(RADIANS(Sight2!DEC2_))*SIN(RADIANS(T136))","v":-0.93239566984863542},null,null,null,null,268,{"$f":"COS(RADIANS(Sight2!HC2_))*COS(RADIANS(AA136))","v":-3.3141308367898692E-2},{"$f":"COS(RADIANS(Sight2!HC2_))*SIN(RADIANS(AA136))","v":-0.94904290055036311}]
[270,-1.83772268236293E-16,-1,null,-180,{"$f":"COS(RADIANS(E137))*COS(RADIANS(Sight2!LHA2_))","v":-0.90630648255889923},-1.22514845490862E-16,{"$f":"F137*COS(RADIANS(90-Sight2!LAT2_))-G137*SIN(RADIANS(90-Sight2!LAT2_))","v":-0.66283060082090095},{"$f":"F137*SIN(RADIANS(90-Sight2!LAT2_))+G137*COS(RADIANS(90-Sight2!LAT2_))","v":-0.61809953481918078},null,{"$f":"COS(RADIANS(E137))*COS(RADIANS(Sight2!AZ_nord2-180))","v":-0.90972658306072596},null,null,null,null,null,null,null,null,270,{"$f":"COS(RADIANS(Sight2!DEC2_))*COS(RADIANS(T137))","v":-1.7145291162303965E-16},{"$f":"COS(RADIANS(Sight2!DEC2_))*SIN(RADIANS(T137))","v":-0.93296400631343779},null,null,null,null,270,{"$f":"COS(RADIANS(Sight2!HC2_))*COS(RADIANS(AA137))","v":-1.7451407574742367E-16},{"$f":"COS(RADIANS(Sight2!HC2_))*SIN(RADIANS(AA137))","v":-0.94962138423973086}]
[272,3.4899496702501281E-2,-0.99939082701909576,null,-182,{"$f":"COS(RADIANS(E138))*COS(RADIANS(Sight2!LHA2_))","v":-0.905754385137306},3.48994967025009E-2,{"$f":"F138*COS(RADIANS(90-Sight2!LAT2_))-G138*SIN(RADIANS(90-Sight2!LAT2_))","v":-0.68622822184607668},{"$f":"F138*SIN(RADIANS(90-Sight2!LAT2_))+G138*COS(RADIANS(90-Sight2!LAT2_))","v":-0.59219912918503925},null,{"$f":"COS(RADIANS(E138))*COS(RADIANS(Sight2!AZ_nord2-180))","v":-0.90917240220631501},null,null,null,null,null,null,null,null,272,{"$f":"COS(RADIANS(Sight2!DEC2_))*COS(RADIANS(T138))","v":3.2559974261888204E-2},{"$f":"COS(RADIANS(Sight2!DEC2_))*SIN(RADIANS(T138))","v":-0.93239566984863542},null,null,null,null,272,{"$f":"COS(RADIANS(Sight2!HC2_))*COS(RADIANS(AA138))","v":3.3141308367899192E-2},{"$f":"COS(RADIANS(Sight2!HC2_))*SIN(RADIANS(AA138))","v":-0.94904290055036311}]
[274,6.9756473744125219E-2,-0.99756405025982431,null,-184,{"$f":"COS(RADIANS(E139))*COS(RADIANS(Sight2!LHA2_))","v":-0.90409876551819024},6.9756473744125275E-2,{"$f":"F139*COS(RADIANS(90-Sight2!LAT2_))-G139*SIN(RADIANS(90-Sight2!LAT2_))","v":-0.70878977948828703},{"$f":"F139*SIN(RADIANS(90-Sight2!LAT2_))+G139*COS(RADIANS(90-Sight2!LAT2_))","v":-0.56557722013326861},null,{"$f":"COS(RADIANS(E139))*COS(RADIANS(Sight2!AZ_nord2-180))","v":-0.90751053482708821},null,null,null,null,null,null,null,null,274,{"$f":"COS(RADIANS(Sight2!DEC2_))*COS(RADIANS(T139))","v":6.5080279210617195E-2},{"$f":"COS(RADIANS(Sight2!DEC2_))*SIN(RADIANS(T139))","v":-0.93069135288466531},null,null,null,null,274,{"$f":"COS(RADIANS(Sight2!HC2_))*COS(RADIANS(AA139))","v":6.6242239156578633E-2},{"$f":"COS(RADIANS(Sight2!HC2_))*SIN(RADIANS(AA139))","v":-0.94730815427552684}]
[276,0.10452846326765299,-0.9945218953682734,null,-186,{"$f":"COS(RADIANS(E140))*COS(RADIANS(Sight2!LHA2_))","v":-0.90134164081902934},0.1045284632676535,{"$f":"F140*COS(RADIANS(90-Sight2!LAT2_))-G140*SIN(RADIANS(90-Sight2!LAT2_))","v":-0.73048778596488673},{"$f":"F140*SIN(RADIANS(90-Sight2!LAT2_))+G140*COS(RADIANS(90-Sight2!LAT2_))","v":-0.53826624235925769},null,{"$f":"COS(RADIANS(E140))*COS(RADIANS(Sight2!AZ_nord2-180))","v":-0.90474300565245613},null,null,null,null,null,null,null,null,276,{"$f":"COS(RADIANS(Sight2!DEC2_))*COS(RADIANS(T140))","v":9.7521293863976552E-2},{"$f":"COS(RADIANS(Sight2!DEC2_))*SIN(RADIANS(T140))","v":-0.92785313186921792},null,null,null,null,276,{"$f":"COS(RADIANS(Sight2!HC2_))*COS(RADIANS(AA140))","v":9.926246398068049E-2},{"$f":"COS(RADIANS(Sight2!HC2_))*SIN(RADIANS(AA140))","v":-0.9444192589363406}]
[278,0.13917310096006547,-0.99026806874157036,null,-188,{"$f":"COS(RADIANS(E141))*COS(RADIANS(Sight2!LHA2_))","v":-0.89748637017156674},0.13917310096006552,{"$f":"F141*COS(RADIANS(90-Sight2!LAT2_))-G141*SIN(RADIANS(90-Sight2!LAT2_))","v":-0.75129580559730558},{"$f":"F141*SIN(RADIANS(90-Sight2!LAT2_))+G141*COS(RADIANS(90-Sight2!LAT2_))","v":-0.51029947008249055},null,{"$f":"COS(RADIANS(E141))*COS(RADIANS(Sight2!AZ_nord2-180))","v":-0.90087318649041281},null,null,null,null,null,null,null,null,278,{"$f":"COS(RADIANS(Sight2!DEC2_))*COS(RADIANS(T141))","v":0.12984349384276722},{"$f":"COS(RADIANS(Sight2!DEC2_))*SIN(RADIANS(T141))","v":-0.92388446473740626},null,null,null,null,278,{"$f":"COS(RADIANS(Sight2!HC2_))*COS(RADIANS(AA141))","v":0.13216175278263317},{"$f":"COS(RADIANS(Sight2!HC2_))*SIN(RADIANS(AA141))","v":-0.94037973420677501}]
[280,0.17364817766692997,-0.98480775301220813,null,-190,{"$f":"COS(RADIANS(E142))*COS(RADIANS(Sight2!LHA2_))","v":-0.89253765062922741},0.17364817766693047,{"$f":"F142*COS(RADIANS(90-Sight2!LAT2_))-G142*SIN(RADIANS(90-Sight2!LAT2_))","v":-0.77118848701885123},{"$f":"F142*SIN(RADIANS(90-Sight2!LAT2_))+G142*COS(RADIANS(90-Sight2!LAT2_))","v":-0.48171097650703543},null,{"$f":"COS(RADIANS(E142))*COS(RADIANS(Sight2!AZ_nord2-180))","v":-0.89590579211950738},null,null,null,null,null,null,null,null,280,{"$f":"COS(RADIANS(Sight2!DEC2_))*COS(RADIANS(T142))","v":0.16200749952516663},{"$f":"COS(RADIANS(Sight2!DEC2_))*SIN(RADIANS(T142))","v":-0.91879018669880419},null,null,null,null,280,{"$f":"COS(RADIANS(Sight2!HC2_))*COS(RADIANS(AA142))","v":0.16490002284677677},{"$f":"COS(RADIANS(Sight2!HC2_))*SIN(RADIANS(AA142))","v":-0.93519450162547202}]
[282,0.20791169081775943,-0.97814760073380558,null,-192,{"$f":"COS(RADIANS(E143))*COS(RADIANS(Sight2!LHA2_))","v":-0.88650151144448186},0.20791169081775951,{"$f":"F143*COS(RADIANS(90-Sight2!LAT2_))-G143*SIN(RADIANS(90-Sight2!LAT2_))","v":-0.79014159406144446},{"$f":"F143*SIN(RADIANS(90-Sight2!LAT2_))+G143*COS(RADIANS(90-Sight2!LAT2_))","v":-0.45253559230859397},null,{"$f":"COS(RADIANS(E143))*COS(RADIANS(Sight2!AZ_nord2-180))","v":-0.8898468745446122},null,null,null,null,null,null,null,null,282,{"$f":"COS(RADIANS(Sight2!DEC2_))*COS(RADIANS(T143))","v":0.19397412402473763},{"$f":"COS(RADIANS(Sight2!DEC2_))*SIN(RADIANS(T143))","v":-0.91257650434648818},null,null,null,null,282,{"$f":"COS(RADIANS(Sight2!HC2_))*COS(RADIANS(AA143))","v":0.19743738763398364},{"$f":"COS(RADIANS(Sight2!HC2_))*SIN(RADIANS(AA143))","v":-0.92886987859960801}]
[284,0.24192189559966745,-0.97029572627599658,null,-194,{"$f":"COS(RADIANS(E144))*COS(RADIANS(Sight2!LHA2_))","v":-0.87938530672313087},0.24192189559966751,{"$f":"F144*COS(RADIANS(90-Sight2!LAT2_))-G144*SIN(RADIANS(90-Sight2!LAT2_))","v":-0.80813203528365563},{"$f":"F144*SIN(RADIANS(90-Sight2!LAT2_))+G144*COS(RADIANS(90-Sight2!LAT2_))","v":-0.42280886319868916},null,{"$f":"COS(RADIANS(E144))*COS(RADIANS(Sight2!AZ_nord2-180))","v":-0.88270381562348776},null,null,null,null,null,null,null,null,284,{"$f":"COS(RADIANS(Sight2!DEC2_))*COS(RADIANS(T144))","v":0.22570442093360699},{"$f":"COS(RADIANS(Sight2!DEC2_))*SIN(RADIANS(T144))","v":-0.90525098809526061},null,null,null,null,284,{"$f":"COS(RADIANS(Sight2!HC2_))*COS(RADIANS(AA144))","v":0.22973420537725586},{"$f":"COS(RADIANS(Sight2!HC2_))*SIN(RADIANS(AA144))","v":-0.92141357070810692}]
[286,0.27563735581699939,-0.96126169593831878,null,-196,{"$f":"COS(RADIANS(E145))*COS(RADIANS(Sight2!LHA2_))","v":-0.87119770646445993},0.275637355816999,{"$f":"F145*COS(RADIANS(90-Sight2!LAT2_))-G145*SIN(RADIANS(90-Sight2!LAT2_))","v":-0.82513789210407096},{"$f":"F145*SIN(RADIANS(90-Sight2!LAT2_))+G145*COS(RADIANS(90-Sight2!LAT2_))","v":-0.39256700661768906},null,{"$f":"COS(RADIANS(E145))*COS(RADIANS(Sight2!AZ_nord2-180))","v":-0.87448531807312535},null,null,null,null,null,null,null,null,286,{"$f":"COS(RADIANS(Sight2!DEC2_))*COS(RADIANS(T145))","v":0.25715973177267032},{"$f":"COS(RADIANS(Sight2!DEC2_))*SIN(RADIANS(T145))","v":-0.89682256295826357},null,null,null,null,286,{"$f":"COS(RADIANS(Sight2!HC2_))*COS(RADIANS(AA145))","v":0.26175112737911821},{"$f":"COS(RADIANS(Sight2!HC2_))*SIN(RADIANS(AA145))","v":-0.91283466231357757}]
[288,0.30901699437494723,-0.95105651629515364,null,-198,{"$f":"COS(RADIANS(E146))*COS(RADIANS(Sight2!LHA2_))","v":-0.86194868599818109},0.30901699437494728,{"$f":"F146*COS(RADIANS(90-Sight2!LAT2_))-G146*SIN(RADIANS(90-Sight2!LAT2_))","v":-0.84113844550570604},{"$f":"F146*SIN(RADIANS(90-Sight2!LAT2_))+G146*COS(RADIANS(90-Sight2!LAT2_))","v":-0.36184686760943691},null,{"$f":"COS(RADIANS(E146))*COS(RADIANS(Sight2!AZ_nord2-180))","v":-0.86520139486682779},null,null,null,null,null,null,null,null,288,{"$f":"COS(RADIANS(Sight2!DEC2_))*COS(RADIANS(T146))","v":0.28830173309098783},{"$f":"COS(RADIANS(Sight2!DEC2_))*SIN(RADIANS(T146))","v":-0.88730149767322786},null,null,null,null,288,{"$f":"COS(RADIANS(Sight2!HC2_))*COS(RADIANS(AA146))","v":0.29344914595193849},{"$f":"COS(RADIANS(Sight2!HC2_))*SIN(RADIANS(AA146))","v":-0.90314360549441997}]
[290,0.34202014332566899,-0.93969262078590832,null,-200,{"$f":"COS(RADIANS(E147))*COS(RADIANS(Sight2!LHA2_))","v":-0.85164951383103027},0.34202014332566866,{"$f":"F147*COS(RADIANS(90-Sight2!LAT2_))-G147*SIN(RADIANS(90-Sight2!LAT2_))","v":-0.85611420127893756},{"$f":"F147*SIN(RADIANS(90-Sight2!LAT2_))+G147*COS(RADIANS(90-Sight2!LAT2_))","v":-0.33068587393123983},null,{"$f":"COS(RADIANS(E147))*COS(RADIANS(Sight2!AZ_nord2-180))","v":-0.85486335703494298},null,null,null,null,null,null,null,null,290,{"$f":"COS(RADIANS(Sight2!DEC2_))*COS(RADIANS(T147))","v":0.31909248315701233},{"$f":"COS(RADIANS(Sight2!DEC2_))*SIN(RADIANS(T147))","v":-0.87669939219159509},null,null,null,null,290,{"$f":"COS(RADIANS(Sight2!HC2_))*COS(RADIANS(AA147))","v":0.32478964194279292},{"$f":"COS(RADIANS(Sight2!HC2_))*SIN(RADIANS(AA147))","v":-0.89235220731057474}]
[292,0.37460659341591196,-0.92718385456678742,null,-202,{"$f":"COS(RADIANS(E148))*COS(RADIANS(Sight2!LHA2_))","v":-0.84031273791782712},0.37460659341591201,{"$f":"F148*COS(RADIANS(90-Sight2!LAT2_))-G148*SIN(RADIANS(90-Sight2!LAT2_))","v":-0.87004691377219379},{"$f":"F148*SIN(RADIANS(90-Sight2!LAT2_))+G148*COS(RADIANS(90-Sight2!LAT2_))","v":-0.29912199045391136},null,{"$f":"COS(RADIANS(E148))*COS(RADIANS(Sight2!AZ_nord2-180))","v":-0.84348379988411659},null,null,null,null,null,null,null,null,292,{"$f":"COS(RADIANS(Sight2!DEC2_))*COS(RADIANS(T148))","v":0.34949446818473828},{"$f":"COS(RADIANS(Sight2!DEC2_))*SIN(RADIANS(T148))","v":-0.86502916354576587},null,null,null,null,292,{"$f":"COS(RADIANS(Sight2!HC2_))*COS(RADIANS(AA148))","v":0.35573443178494835},{"$f":"COS(RADIANS(Sight2!HC2_))*SIN(RADIANS(AA148))","v":-0.88047361541844193}]
[294,0.40673664307579976,-0.91354545764260109,null,-204,{"$f":"COS(RADIANS(E149))*COS(RADIANS(Sight2!LHA2_))","v":-0.82795217037372548},0.40673664307580021,{"$f":"F149*COS(RADIANS(90-Sight2!LAT2_))-G149*SIN(RADIANS(90-Sight2!LAT2_))","v":-0.88291960812147163},{"$f":"F149*SIN(RADIANS(90-Sight2!LAT2_))+G149*COS(RADIANS(90-Sight2!LAT2_))","v":-0.26719367290742529},null,{"$f":"COS(RADIANS(E149))*COS(RADIANS(Sight2!AZ_nord2-180))","v":-0.83107658765185044},null,null,null,null,null,null,null,null,294,{"$f":"COS(RADIANS(Sight2!DEC2_))*COS(RADIANS(T149))","v":0.37947064803847697},{"$f":"COS(RADIANS(Sight2!DEC2_))*SIN(RADIANS(T149))","v":-0.85230503011168413},null,null,null,null,294,{"$f":"COS(RADIANS(Sight2!HC2_))*COS(RADIANS(AA149))","v":0.38624581401866231},{"$f":"COS(RADIANS(Sight2!HC2_))*SIN(RADIANS(AA149))","v":-0.86752230205248526}]
[296,0.4383711467890774,-0.89879404629916704,null,-206,{"$f":"COS(RADIANS(E150))*COS(RADIANS(Sight2!LHA2_))","v":-0.81458287064627843},0.43837114678907746,{"$f":"F150*COS(RADIANS(90-Sight2!LAT2_))-G150*SIN(RADIANS(90-Sight2!LAT2_))","v":-0.89471660093159333},{"$f":"F150*SIN(RADIANS(90-Sight2!LAT2_))+G150*COS(RADIANS(90-Sight2!LAT2_))","v":-0.23493982102853173},null,{"$f":"COS(RADIANS(E150))*COS(RADIANS(Sight2!AZ_nord2-180))","v":-0.81765683661506505},null,null,null,null,null,null,null,null,296,{"$f":"COS(RADIANS(Sight2!DEC2_))*COS(RADIANS(T150))","v":0.40898450136055375},{"$f":"COS(RADIANS(Sight2!DEC2_))*SIN(RADIANS(T150))","v":-0.83854249428593641},null,null,null,null,296,{"$f":"COS(RADIANS(Sight2!HC2_))*COS(RADIANS(AA150))","v":0.41628661522460192},{"$f":"COS(RADIANS(Sight2!HC2_))*SIN(RADIANS(AA150))","v":-0.85351404639304373}]
[298,0.46947156278589042,-0.8829475928589271,null,-208,{"$f":"COS(RADIANS(E151))*COS(RADIANS(Sight2!LHA2_))","v":-0.80022112716782112},0.46947156278589086,{"$f":"F151*COS(RADIANS(90-Sight2!LAT2_))-G151*SIN(RADIANS(90-Sight2!LAT2_))","v":-0.90542351938400678},{"$f":"F151*SIN(RADIANS(90-Sight2!LAT2_))+G151*COS(RADIANS(90-Sight2!LAT2_))","v":-0.20239973116741999},null,{"$f":"COS(RADIANS(E151))*COS(RADIANS(Sight2!AZ_nord2-180))","v":-0.80324089667324461},null,null,null,null,null,null,null,null,298,{"$f":"COS(RADIANS(Sight2!DEC2_))*COS(RADIANS(T151))","v":0.43800007006695496},{"$f":"COS(RADIANS(Sight2!DEC2_))*SIN(RADIANS(T151))","v":-0.82375832359847079},null,null,null,null,298,{"$f":"COS(RADIANS(Sight2!HC2_))*COS(RADIANS(AA151))","v":0.44582023531392695},{"$f":"COS(RADIANS(Sight2!HC2_))*SIN(RADIANS(AA151))","v":-0.83846591534183268}]
[300,0.50000000000000011,-0.8660254037844386,null,-210,{"$f":"COS(RADIANS(E152))*COS(RADIANS(Sight2!LHA2_))","v":-0.78488443751052495},0.50000000000000011,{"$f":"F152*COS(RADIANS(90-Sight2!LAT2_))-G152*SIN(RADIANS(90-Sight2!LAT2_))","v":-0.91502731874785215},{"$f":"F152*SIN(RADIANS(90-Sight2!LAT2_))+G152*COS(RADIANS(90-Sight2!LAT2_))","v":-0.16961304841116925},null,{"$f":"COS(RADIANS(E152))*COS(RADIANS(Sight2!AZ_nord2-180))","v":-0.78784633142860283},null,null,null,null,null,null,null,null,300,{"$f":"COS(RADIANS(Sight2!DEC2_))*COS(RADIANS(T152))","v":0.46648200315671901},{"$f":"COS(RADIANS(Sight2!DEC2_))*SIN(RADIANS(T152))","v":-0.8079705302839425},null,null,null,null,300,{"$f":"COS(RADIANS(Sight2!HC2_))*COS(RADIANS(AA152))","v":0.47481069211986554},{"$f":"COS(RADIANS(Sight2!HC2_))*SIN(RADIANS(AA152))","v":-0.82239624272855039}]
[302,0.52991926423320468,-0.84804809615642618,null,-212,{"$f":"COS(RADIANS(E153))*COS(RADIANS(Sight2!LHA2_))","v":-0.7685914870683016},0.52991926423320479,{"$f":"F153*COS(RADIANS(90-Sight2!LAT2_))-G153*SIN(RADIANS(90-Sight2!LAT2_))","v":-0.92351629827295656},{"$f":"F153*SIN(RADIANS(90-Sight2!LAT2_))+G153*COS(RADIANS(90-Sight2!LAT2_))","v":-0.13661971828231706},null,{"$f":"COS(RADIANS(E153))*COS(RADIANS(Sight2!AZ_nord2-180))","v":-0.77149189678753949},null,null,null,null,null,null,null,null,302,{"$f":"COS(RADIANS(Sight2!DEC2_))*COS(RADIANS(T153))","v":0.49439559978167985},{"$f":"COS(RADIANS(Sight2!DEC2_))*SIN(RADIANS(T153))","v":-0.79119834933658284},null,null,null,null,302,{"$f":"COS(RADIANS(Sight2!HC2_))*COS(RADIANS(AA153))","v":0.50322266523643555},{"$f":"COS(RADIANS(Sight2!HC2_))*SIN(RADIANS(AA153))","v":-0.80532460697393382}]
[304,0.55919290347074702,-0.82903757255504162,null,-214,{"$f":"COS(RADIANS(E154))*COS(RADIANS(Sight2!LHA2_))","v":-0.75136212629152821},0.55919290347074668,{"$f":"F154*COS(RADIANS(90-Sight2!LAT2_))-G154*SIN(RADIANS(90-Sight2!LAT2_))","v":-0.93088011544539606},{"$f":"F154*SIN(RADIANS(90-Sight2!LAT2_))+G154*COS(RADIANS(90-Sight2!LAT2_))","v":-0.10345993807139203},null,{"$f":"COS(RADIANS(E154))*COS(RADIANS(Sight2!AZ_nord2-180))","v":-0.7541975181094569},null,null,null,null,null,null,null,null,304,{"$f":"COS(RADIANS(Sight2!DEC2_))*COS(RADIANS(T154))","v":0.52170685152411167},{"$f":"COS(RADIANS(Sight2!DEC2_))*SIN(RADIANS(T154))","v":-0.77346221507531898},null,null,null,null,304,{"$f":"COS(RADIANS(Sight2!HC2_))*COS(RADIANS(AA154))","v":0.53102153905092497},{"$f":"COS(RADIANS(Sight2!HC2_))*SIN(RADIANS(AA154))","v":-0.78727180723646495}]
[306,0.58778525229247292,-0.80901699437494756,null,-216,{"$f":"COS(RADIANS(E155))*COS(RADIANS(Sight2!LHA2_))","v":-0.7332173465023315},0.58778525229247303,{"$f":"F155*COS(RADIANS(90-Sight2!LAT2_))-G155*SIN(RADIANS(90-Sight2!LAT2_))","v":-0.93710979858825461},{"$f":"F155*SIN(RADIANS(90-Sight2!LAT2_))+G155*COS(RADIANS(90-Sight2!LAT2_))","v":-7.0174107862708612E-2},null,{"$f":"COS(RADIANS(E155))*COS(RADIANS(Sight2!AZ_nord2-180))","v":-0.73598426593077959},null,null,null,null,null,null,null,null,306,{"$f":"COS(RADIANS(Sight2!DEC2_))*COS(RADIANS(T155))","v":0.54838248383074029},{"$f":"COS(RADIANS(Sight2!DEC2_))*SIN(RADIANS(T155))","v":-0.754783736247707},null,null,null,null,306,{"$f":"COS(RADIANS(Sight2!HC2_))*COS(RADIANS(AA155))","v":0.55817344491767762},{"$f":"COS(RADIANS(Sight2!HC2_))*SIN(RADIANS(AA155))","v":-0.76825983807180431}]
[308,0.61566147532565851,-0.78801075360672179,null,-218,{"$f":"COS(RADIANS(E156))*COS(RADIANS(Sight2!LHA2_))","v":-0.7141792543198956},0.61566147532565818,{"$f":"F156*COS(RADIANS(90-Sight2!LAT2_))-G156*SIN(RADIANS(90-Sight2!LAT2_))","v":-0.9421977577922318},{"$f":"F156*SIN(RADIANS(90-Sight2!LAT2_))+G156*COS(RADIANS(90-Sight2!LAT2_))","v":-3.6802781313087118E-2},null,{"$f":"COS(RADIANS(E156))*COS(RADIANS(Sight2!AZ_nord2-180))","v":-0.71687433029375081},null,null,null,null,null,null,null,null,308,{"$f":"COS(RADIANS(Sight2!DEC2_))*COS(RADIANS(T156))","v":0.57438999655266809},{"$f":"COS(RADIANS(Sight2!DEC2_))*SIN(RADIANS(T156))","v":-0.73518566970299848},null,null,null,null,308,{"$f":"COS(RADIANS(Sight2!HC2_))*COS(RADIANS(AA156))","v":0.58464530242182677},{"$f":"COS(RADIANS(Sight2!HC2_))*SIN(RADIANS(AA156))","v":-0.74831186263580862}]
[310,0.64278760968653925,-0.76604444311897812,null,-220,{"$f":"COS(RADIANS(E157))*COS(RADIANS(Sight2!LHA2_))","v":-0.69427104472695167},0.64278760968653925,{"$f":"F157*COS(RADIANS(90-Sight2!LAT2_))-G157*SIN(RADIANS(90-Sight2!LAT2_))","v":-0.94613779416277788},{"$f":"F157*SIN(RADIANS(90-Sight2!LAT2_))+G157*COS(RADIANS(90-Sight2!LAT2_))","v":-3.3866162434695313E-3},null,{"$f":"COS(RADIANS(E157))*COS(RADIANS(Sight2!AZ_nord2-180))","v":-0.69689099371128449},null,null,null,null,null,null,null,null,310,{"$f":"COS(RADIANS(Sight2!DEC2_))*COS(RADIANS(T157))","v":0.59969770354179197},{"$f":"COS(RADIANS(Sight2!DEC2_))*SIN(RADIANS(T157))","v":-0.7146918926664283},null,null,null,null,310,{"$f":"COS(RADIANS(Sight2!HC2_))*COS(RADIANS(AA157))","v":0.61040485968267921},{"$f":"COS(RADIANS(Sight2!HC2_))*SIN(RADIANS(AA157))","v":-0.72745218446379778}]
[312,0.66913060635885779,-0.74314482547739458,null,-222,{"$f":"COS(RADIANS(E158))*COS(RADIANS(Sight2!LHA2_))","v":-0.67351697281026424},0.66913060635885824,{"$f":"F158*COS(RADIANS(90-Sight2!LAT2_))-G158*SIN(RADIANS(90-Sight2!LAT2_))","v":-0.94892510737249136},{"$f":"F158*SIN(RADIANS(90-Sight2!LAT2_))+G158*COS(RADIANS(90-Sight2!LAT2_))","v":3.0033674896372431E-2},null,{"$f":"COS(RADIANS(E158))*COS(RADIANS(Sight2!AZ_nord2-180))","v":-0.67605860280080943},null,null,null,null,null,null,null,null,312,{"$f":"COS(RADIANS(Sight2!DEC2_))*COS(RADIANS(T158))","v":0.62427477125549991},{"$f":"COS(RADIANS(Sight2!DEC2_))*SIN(RADIANS(T158))","v":-0.69332737364849062},null,null,null,null,312,{"$f":"COS(RADIANS(Sight2!HC2_))*COS(RADIANS(AA158))","v":0.63542073264766896},{"$f":"COS(RADIANS(Sight2!HC2_))*SIN(RADIANS(AA158))","v":-0.70570621786043664}]
[314,0.69465837045899725,-0.71933980033865119,null,-224,{"$f":"COS(RADIANS(E159))*COS(RADIANS(Sight2!LHA2_))","v":-0.65194232420954368},0.69465837045899737,{"$f":"F159*COS(RADIANS(90-Sight2!LAT2_))-G159*SIN(RADIANS(90-Sight2!LAT2_))","v":-0.95055630150957882},{"$f":"F159*SIN(RADIANS(90-Sight2!LAT2_))+G159*COS(RADIANS(90-Sight2!LAT2_))","v":6.3417374629686274E-2},null,{"$f":"COS(RADIANS(E159))*COS(RADIANS(Sight2!AZ_nord2-180))","v":-0.65440253862166586},null,null,null,null,null,null,null,null,314,{"$f":"COS(RADIANS(Sight2!DEC2_))*COS(RADIANS(T159))","v":0.64809125632259035},{"$f":"COS(RADIANS(Sight2!DEC2_))*SIN(RADIANS(T159))","v":-0.67111814202465647},null,null,null,null,314,{"$f":"COS(RADIANS(Sight2!HC2_))*COS(RADIANS(AA159))","v":0.65966244332898871},{"$f":"COS(RADIANS(Sight2!HC2_))*SIN(RADIANS(AA159))","v":-0.6831004569363216}]
[316,0.71933980033865086,-0.69465837045899759,null,-226,{"$f":"COS(RADIANS(E160))*COS(RADIANS(Sight2!LHA2_))","v":-0.62957338431079057},0.71933980033865119,{"$f":"F160*COS(RADIANS(90-Sight2!LAT2_))-G160*SIN(RADIANS(90-Sight2!LAT2_))","v":-0.95102938921525049},{"$f":"F160*SIN(RADIANS(90-Sight2!LAT2_))+G160*COS(RADIANS(90-Sight2!LAT2_))","v":9.6723810060711235E-2},null,{"$f":"COS(RADIANS(E160))*COS(RADIANS(Sight2!AZ_nord2-180))","v":-0.6319491857521955},null,null,null,null,null,null,null,null,316,{"$f":"COS(RADIANS(Sight2!DEC2_))*COS(RADIANS(T160))","v":0.67111814202465614},{"$f":"COS(RADIANS(Sight2!DEC2_))*SIN(RADIANS(T160))","v":-0.64809125632259068},null,null,null,null,316,{"$f":"COS(RADIANS(Sight2!HC2_))*COS(RADIANS(AA160))","v":0.68310045693632127},{"$f":"COS(RADIANS(Sight2!HC2_))*SIN(RADIANS(AA160))","v":-0.65966244332898905}]
[318,0.74314482547739424,-0.66913060635885813,null,-228,{"$f":"COS(RADIANS(E161))*COS(RADIANS(Sight2!LHA2_))","v":-0.60643740622160014},0.74314482547739436,{"$f":"F161*COS(RADIANS(90-Sight2!LAT2_))-G161*SIN(RADIANS(90-Sight2!LAT2_))","v":-0.95034379410501035},{"$f":"F161*SIN(RADIANS(90-Sight2!LAT2_))+G161*COS(RADIANS(90-Sight2!LAT2_))","v":0.12991240242833829},null,{"$f":"COS(RADIANS(E161))*COS(RADIANS(Sight2!AZ_nord2-180))","v":-0.6087259001441957},null,null,null,null,null,null,null,null,318,{"$f":"COS(RADIANS(Sight2!DEC2_))*COS(RADIANS(T161))","v":0.69332737364849029},{"$f":"COS(RADIANS(Sight2!DEC2_))*SIN(RADIANS(T161))","v":-0.62427477125550013},null,null,null,null,318,{"$f":"COS(RADIANS(Sight2!HC2_))*COS(RADIANS(AA161))","v":0.7057062178604363},{"$f":"COS(RADIANS(Sight2!HC2_))*SIN(RADIANS(AA161))","v":-0.6354207326476693}]
[320,0.76604444311897779,-0.64278760968653958,null,-230,{"$f":"COS(RADIANS(E162))*COS(RADIANS(Sight2!LHA2_))","v":-0.58256257756745022},0.7660444431189779,{"$f":"F162*COS(RADIANS(90-Sight2!LAT2_))-G162*SIN(RADIANS(90-Sight2!LAT2_))","v":-0.94850035147089262},{"$f":"F162*SIN(RADIANS(90-Sight2!LAT2_))+G162*COS(RADIANS(90-Sight2!LAT2_))","v":0.16294271654507747},null,{"$f":"COS(RADIANS(E162))*COS(RADIANS(Sight2!AZ_nord2-180))","v":-0.58476097579390718},null,null,null,null,null,null,null,null,320,{"$f":"COS(RADIANS(Sight2!DEC2_))*COS(RADIANS(T162))","v":0.71469189266642796},{"$f":"COS(RADIANS(Sight2!DEC2_))*SIN(RADIANS(T162))","v":-0.5996977035417923},null,null,null,null,320,{"$f":"COS(RADIANS(Sight2!HC2_))*COS(RADIANS(AA162))","v":0.72745218446379745},{"$f":"COS(RADIANS(Sight2!HC2_))*SIN(RADIANS(AA162))","v":-0.61040485968267955}]
[322,0.78801075360672201,-0.61566147532565818,null,-232,{"$f":"COS(RADIANS(E163))*COS(RADIANS(Sight2!LHA2_))","v":-0.55797798614941974},0.78801075360672213,{"$f":"F163*COS(RADIANS(90-Sight2!LAT2_))-G163*SIN(RADIANS(90-Sight2!LAT2_))","v":-0.94550130726378634},{"$f":"F163*SIN(RADIANS(90-Sight2!LAT2_))+G163*COS(RADIANS(90-Sight2!LAT2_))","v":0.19577451006110863},null,{"$f":"COS(RADIANS(E163))*COS(RADIANS(Sight2!AZ_nord2-180))","v":-0.56008361027013631},null,null,null,null,null,null,null,null,{"$f":"SUM(T162+2)","v":322},{"$f":"COS(RADIANS(Sight2!DEC2_))*COS(RADIANS(T163))","v":0.7351856697029987},{"$f":"COS(RADIANS(Sight2!DEC2_))*SIN(RADIANS(T163))","v":-0.57438999655266776},null,null,null,null,322,{"$f":"COS(RADIANS(Sight2!HC2_))*COS(RADIANS(AA163))","v":0.74831186263580884},{"$f":"COS(RADIANS(Sight2!HC2_))*SIN(RADIANS(AA163))","v":-0.58464530242182644}]
[324,0.80901699437494734,-0.58778525229247336,null,-234,{"$f":"COS(RADIANS(E164))*COS(RADIANS(Sight2!LHA2_))","v":-0.53271358450518658},0.80901699437494734,{"$f":"F164*COS(RADIANS(90-Sight2!LAT2_))-G164*SIN(RADIANS(90-Sight2!LAT2_))","v":-0.94135031535709057},{"$f":"F164*SIN(RADIANS(90-Sight2!LAT2_))+G164*COS(RADIANS(90-Sight2!LAT2_))","v":0.22836778249338091},null,{"$f":"COS(RADIANS(E164))*COS(RADIANS(Sight2!AZ_nord2-180))","v":-0.53472386914151848},null,null,null,null,null,null,null,null,324,{"$f":"COS(RADIANS(Sight2!DEC2_))*COS(RADIANS(T164))","v":0.75478373624770678},{"$f":"COS(RADIANS(Sight2!DEC2_))*SIN(RADIANS(T164))","v":-0.54838248383074073},null,null,null,null,324,{"$f":"COS(RADIANS(Sight2!HC2_))*COS(RADIANS(AA164))","v":0.76825983807180409},{"$f":"COS(RADIANS(Sight2!HC2_))*SIN(RADIANS(AA164))","v":-0.55817344491767795}]
[326,0.82903757255504185,-0.55919290347074657,null,-236,{"$f":"COS(RADIANS(E165))*COS(RADIANS(Sight2!LHA2_))","v":-0.50680015341647044},0.82903757255504185,{"$f":"F165*COS(RADIANS(90-Sight2!LAT2_))-G165*SIN(RADIANS(90-Sight2!LAT2_))","v":-0.93605243309503228},{"$f":"F165*SIN(RADIANS(90-Sight2!LAT2_))+G165*COS(RADIANS(90-Sight2!LAT2_))","v":0.26068282396004594},null,{"$f":"COS(RADIANS(E165))*COS(RADIANS(Sight2!AZ_nord2-180))","v":-0.5087126493462486},null,null,null,null,null,null,null,null,326,{"$f":"COS(RADIANS(Sight2!DEC2_))*COS(RADIANS(T165))","v":0.7734622150753192},{"$f":"COS(RADIANS(Sight2!DEC2_))*SIN(RADIANS(T165))","v":-0.52170685152411123},null,null,null,null,326,{"$f":"COS(RADIANS(Sight2!HC2_))*COS(RADIANS(AA165))","v":0.78727180723646517},{"$f":"COS(RADIANS(Sight2!HC2_))*SIN(RADIANS(AA165))","v":-0.53102153905092453}]
[328,0.84804809615642596,-0.52991926423320501,null,-238,{"$f":"COS(RADIANS(E166))*COS(RADIANS(Sight2!LHA2_))","v":-0.48026926440739592},0.84804809615642596,{"$f":"F166*COS(RADIANS(90-Sight2!LAT2_))-G166*SIN(RADIANS(90-Sight2!LAT2_))","v":-0.92961411513107162},{"$f":"F166*SIN(RADIANS(90-Sight2!LAT2_))+G166*COS(RADIANS(90-Sight2!LAT2_))","v":0.29268026356082588},null,{"$f":"COS(RADIANS(E166))*COS(RADIANS(Sight2!AZ_nord2-180))","v":-0.48208164154892758},null,null,null,null,null,null,null,null,328,{"$f":"COS(RADIANS(Sight2!DEC2_))*COS(RADIANS(T166))","v":0.79119834933658273},{"$f":"COS(RADIANS(Sight2!DEC2_))*SIN(RADIANS(T166))","v":-0.49439559978168018},null,null,null,null,328,{"$f":"COS(RADIANS(Sight2!HC2_))*COS(RADIANS(AA166))","v":0.8053246069739336},{"$f":"COS(RADIANS(Sight2!HC2_))*SIN(RADIANS(AA166))","v":-0.50322266523643588}]
[330,0.86602540378443837,-0.50000000000000044,null,-240,{"$f":"COS(RADIANS(E167))*COS(RADIANS(Sight2!LHA2_))","v":-0.45315324127945},0.86602540378443837,{"$f":"F167*COS(RADIANS(90-Sight2!LAT2_))-G167*SIN(RADIANS(90-Sight2!LAT2_))","v":-0.92204320556390074},{"$f":"F167*SIN(RADIANS(90-Sight2!LAT2_))+G167*COS(RADIANS(90-Sight2!LAT2_))","v":0.32432111734439512},null,{"$f":"COS(RADIANS(E167))*COS(RADIANS(Sight2!AZ_nord2-180))","v":-0.45486329153036337},null,null,null,null,null,null,null,null,330,{"$f":"COS(RADIANS(Sight2!DEC2_))*COS(RADIANS(T167))","v":0.80797053028394228},{"$f":"COS(RADIANS(Sight2!DEC2_))*SIN(RADIANS(T167))","v":-0.46648200315671928},null,null,null,null,330,{"$f":"COS(RADIANS(Sight2!HC2_))*COS(RADIANS(AA167))","v":0.82239624272855028},{"$f":"COS(RADIANS(Sight2!HC2_))*SIN(RADIANS(AA167))","v":-0.47481069211986587}]
[332,0.88294759285892688,-0.46947156278589081,null,-242,{"$f":"COS(RADIANS(E168))*COS(RADIANS(Sight2!LHA2_))","v":-0.42548512072991007},0.88294759285892699,{"$f":"F168*COS(RADIANS(90-Sight2!LAT2_))-G168*SIN(RADIANS(90-Sight2!LAT2_))","v":-0.91334892838061821},{"$f":"F168*SIN(RADIANS(90-Sight2!LAT2_))+G168*COS(RADIANS(90-Sight2!LAT2_))","v":0.35556683580431958},null,{"$f":"COS(RADIANS(E168))*COS(RADIANS(Sight2!AZ_nord2-180))","v":-0.42709076065738744},null,null,null,null,null,null,null,null,332,{"$f":"COS(RADIANS(Sight2!DEC2_))*COS(RADIANS(T168))","v":0.82375832359847057},{"$f":"COS(RADIANS(Sight2!DEC2_))*SIN(RADIANS(T168))","v":-0.43800007006695535},null,null,null,null,332,{"$f":"COS(RADIANS(Sight2!HC2_))*COS(RADIANS(AA168))","v":0.83846591534183246},{"$f":"COS(RADIANS(Sight2!HC2_))*SIN(RADIANS(AA168))","v":-0.44582023531392734}]
[334,0.89879404629916682,-0.43837114678907779,null,-244,{"$f":"COS(RADIANS(E169))*COS(RADIANS(Sight2!LHA2_))","v":-0.39729861210171996},0.89879404629916682,{"$f":"F169*COS(RADIANS(90-Sight2!LAT2_))-G169*SIN(RADIANS(90-Sight2!LAT2_))","v":-0.90354187621872095},{"$f":"F169*SIN(RADIANS(90-Sight2!LAT2_))+G169*COS(RADIANS(90-Sight2!LAT2_))","v":0.38637935084568797},null,{"$f":"COS(RADIANS(E169))*COS(RADIANS(Sight2!AZ_nord2-180))","v":-0.39879788548083961},null,null,null,null,null,null,null,null,334,{"$f":"COS(RADIANS(Sight2!DEC2_))*COS(RADIANS(T169))","v":0.83854249428593619},{"$f":"COS(RADIANS(Sight2!DEC2_))*SIN(RADIANS(T169))","v":-0.40898450136055414},null,null,null,null,334,{"$f":"COS(RADIANS(Sight2!HC2_))*COS(RADIANS(AA169))","v":0.85351404639304351},{"$f":"COS(RADIANS(Sight2!HC2_))*SIN(RADIANS(AA169))","v":-0.41628661522460231}]
[336,0.91354545764260098,-0.40673664307580015,null,-246,{"$f":"COS(RADIANS(E170))*COS(RADIANS(Sight2!LHA2_))","v":-0.36862805631384282},0.91354545764260098,{"$f":"F170*COS(RADIANS(90-Sight2!LAT2_))-G170*SIN(RADIANS(90-Sight2!LAT2_))","v":-0.89263399746060745},{"$f":"F170*SIN(RADIANS(90-Sight2!LAT2_))+G170*COS(RADIANS(90-Sight2!LAT2_))","v":0.41672112216522816},null,{"$f":"COS(RADIANS(E170))*COS(RADIANS(Sight2!AZ_nord2-180))","v":-0.37001913651093771},null,null,null,null,null,null,null,null,336,{"$f":"COS(RADIANS(Sight2!DEC2_))*COS(RADIANS(T170))","v":0.85230503011168401},{"$f":"COS(RADIANS(Sight2!DEC2_))*SIN(RADIANS(T170))","v":-0.3794706480384773},null,null,null,null,336,{"$f":"COS(RADIANS(Sight2!HC2_))*COS(RADIANS(AA170))","v":0.86752230205248515},{"$f":"COS(RADIANS(Sight2!HC2_))*SIN(RADIANS(AA170))","v":-0.3862458140186627}]
[338,0.92718385456678731,-0.37460659341591235,null,-248,{"$f":"COS(RADIANS(E171))*COS(RADIANS(Sight2!LHA2_))","v":-0.33950838402214717},0.92718385456678731,{"$f":"F171*COS(RADIANS(90-Sight2!LAT2_))-G171*SIN(RADIANS(90-Sight2!LAT2_))","v":-0.88063858167631515},{"$f":"F171*SIN(RADIANS(90-Sight2!LAT2_))+G171*COS(RADIANS(90-Sight2!LAT2_))","v":0.44655518298837715},null,{"$f":"COS(RADIANS(E171))*COS(RADIANS(Sight2!AZ_nord2-180))","v":-0.34078957622027656},null,null,null,null,null,null,null,null,338,{"$f":"COS(RADIANS(Sight2!DEC2_))*COS(RADIANS(T171))","v":0.86502916354576576},{"$f":"COS(RADIANS(Sight2!DEC2_))*SIN(RADIANS(T171))","v":-0.34949446818473867},null,null,null,null,338,{"$f":"COS(RADIANS(Sight2!HC2_))*COS(RADIANS(AA171))","v":0.88047361541844182},{"$f":"COS(RADIANS(Sight2!HC2_))*SIN(RADIANS(AA171))","v":-0.35573443178494873}]
[340,0.93969262078590843,-0.3420201433256686,null,-250,{"$f":"COS(RADIANS(E172))*COS(RADIANS(Sight2!LHA2_))","v":-0.30997507306177724},0.93969262078590843,{"$f":"F172*COS(RADIANS(90-Sight2!LAT2_))-G172*SIN(RADIANS(90-Sight2!LAT2_))","v":-0.86757024343222444},{"$f":"F172*SIN(RADIANS(90-Sight2!LAT2_))+G172*COS(RADIANS(90-Sight2!LAT2_))","v":0.47584518510760843},null,{"$f":"COS(RADIANS(E172))*COS(RADIANS(Sight2!AZ_nord2-180))","v":-0.3111448163256002},null,null,null,null,null,null,null,null,340,{"$f":"COS(RADIANS(Sight2!DEC2_))*COS(RADIANS(T172))","v":0.87669939219159521},{"$f":"COS(RADIANS(Sight2!DEC2_))*SIN(RADIANS(T172))","v":-0.319092483157012},null,null,null,null,340,{"$f":"COS(RADIANS(Sight2!HC2_))*COS(RADIANS(AA172))","v":0.89235220731057485},{"$f":"COS(RADIANS(Sight2!HC2_))*SIN(RADIANS(AA172))","v":-0.32478964194279258}]
[342,0.95105651629515353,-0.30901699437494762,null,-252,{"$f":"COS(RADIANS(E173))*COS(RADIANS(Sight2!LHA2_))","v":-0.28006410522288189},0.95105651629515353,{"$f":"F173*COS(RADIANS(90-Sight2!LAT2_))-G173*SIN(RADIANS(90-Sight2!LAT2_))","v":-0.85344490448546317},{"$f":"F173*SIN(RADIANS(90-Sight2!LAT2_))+G173*COS(RADIANS(90-Sight2!LAT2_))","v":0.50455544316711698},null,{"$f":"COS(RADIANS(E173))*COS(RADIANS(Sight2!AZ_nord2-180))","v":-0.28112097440041661},null,null,null,null,null,null,null,null,342,{"$f":"COS(RADIANS(Sight2!DEC2_))*COS(RADIANS(T173))","v":0.88730149767322775},{"$f":"COS(RADIANS(Sight2!DEC2_))*SIN(RADIANS(T173))","v":-0.28830173309098822},null,null,null,null,342,{"$f":"COS(RADIANS(Sight2!HC2_))*COS(RADIANS(AA173))","v":0.90314360549441985},{"$f":"COS(RADIANS(Sight2!HC2_))*SIN(RADIANS(AA173))","v":-0.29344914595193888}]
[344,0.96126169593831889,-0.27563735581699894,null,-254,{"$f":"COS(RADIANS(E174))*COS(RADIANS(Sight2!LHA2_))","v":-0.24981192241234002},0.96126169593831901,{"$f":"F174*COS(RADIANS(90-Sight2!LAT2_))-G174*SIN(RADIANS(90-Sight2!LAT2_))","v":-0.83827977438569556},{"$f":"F174*SIN(RADIANS(90-Sight2!LAT2_))+G174*COS(RADIANS(90-Sight2!LAT2_))","v":0.53265097813993512},null,{"$f":"COS(RADIANS(E174))*COS(RADIANS(Sight2!AZ_nord2-180))","v":-0.25075462987129193},null,null,null,null,null,null,null,null,344,{"$f":"COS(RADIANS(Sight2!DEC2_))*COS(RADIANS(T174))","v":0.89682256295826368},{"$f":"COS(RADIANS(Sight2!DEC2_))*SIN(RADIANS(T174))","v":-0.25715973177266988},null,null,null,null,344,{"$f":"COS(RADIANS(Sight2!HC2_))*COS(RADIANS(AA174))","v":0.91283466231357768},{"$f":"COS(RADIANS(Sight2!HC2_))*SIN(RADIANS(AA174))","v":-0.26175112737911777}]
[346,0.97029572627599647,-0.24192189559966787,null,-256,{"$f":"COS(RADIANS(E175))*COS(RADIANS(Sight2!LHA2_))","v":-0.21925538225491614},0.97029572627599647,{"$f":"F175*COS(RADIANS(90-Sight2!LAT2_))-G175*SIN(RADIANS(90-Sight2!LAT2_))","v":-0.82209332950793956},{"$f":"F175*SIN(RADIANS(90-Sight2!LAT2_))+G175*COS(RADIANS(90-Sight2!LAT2_))","v":0.5600975599444824},null,{"$f":"COS(RADIANS(E175))*COS(RADIANS(Sight2!AZ_nord2-180))","v":-0.22008277945145946},null,null,null,null,null,null,null,null,346,{"$f":"COS(RADIANS(Sight2!DEC2_))*COS(RADIANS(T175))","v":0.9052509880952605},{"$f":"COS(RADIANS(Sight2!DEC2_))*SIN(RADIANS(T175))","v":-0.22570442093360737},null,null,null,null,346,{"$f":"COS(RADIANS(Sight2!HC2_))*COS(RADIANS(AA175))","v":0.92141357070810681},{"$f":"COS(RADIANS(Sight2!HC2_))*SIN(RADIANS(AA175))","v":-0.22973420537725625}]
[348,0.97814760073380558,-0.20791169081775987,null,-258,{"$f":"COS(RADIANS(E176))*COS(RADIANS(Sight2!LHA2_))","v":-0.18843171318791727},0.97814760073380558,{"$f":"F176*COS(RADIANS(90-Sight2!LAT2_))-G176*SIN(RADIANS(90-Sight2!LAT2_))","v":-0.80490529054194815},{"$f":"F176*SIN(RADIANS(90-Sight2!LAT2_))+G176*COS(RADIANS(90-Sight2!LAT2_))","v":0.58686174914865241},null,{"$f":"COS(RADIANS(E176))*COS(RADIANS(Sight2!AZ_nord2-180))","v":-0.18914279206601872},null,null,null,null,null,null,null,null,348,{"$f":"COS(RADIANS(Sight2!DEC2_))*COS(RADIANS(T176))","v":0.91257650434648818},{"$f":"COS(RADIANS(Sight2!DEC2_))*SIN(RADIANS(T176))","v":-0.19397412402473804},null,null,null,null,348,{"$f":"COS(RADIANS(Sight2!HC2_))*COS(RADIANS(AA176))","v":0.92886987859960801},{"$f":"COS(RADIANS(Sight2!HC2_))*SIN(RADIANS(AA176))","v":-0.19743738763398408}]
[350,0.98480775301220802,-0.17364817766693039,null,-260,{"$f":"COS(RADIANS(E177))*COS(RADIANS(Sight2!LHA2_))","v":-0.15737846910407843},0.98480775301220802,{"$f":"F177*COS(RADIANS(90-Sight2!LAT2_))-G177*SIN(RADIANS(90-Sight2!LAT2_))","v":-0.78673659846558586},{"$f":"F177*SIN(RADIANS(90-Sight2!LAT2_))+G177*COS(RADIANS(90-Sight2!LAT2_))","v":0.61291093771060801},null,{"$f":"COS(RADIANS(E177))*COS(RADIANS(Sight2!AZ_nord2-180))","v":-0.15797236332365838},null,null,null,null,null,null,null,null,350,{"$f":"COS(RADIANS(Sight2!DEC2_))*COS(RADIANS(T177))","v":0.91879018669880408},{"$f":"COS(RADIANS(Sight2!DEC2_))*SIN(RADIANS(T177))","v":-0.16200749952516702},null,null,null,null,350,{"$f":"COS(RADIANS(Sight2!HC2_))*COS(RADIANS(AA177))","v":0.93519450162547191},{"$f":"COS(RADIANS(Sight2!HC2_))*SIN(RADIANS(AA177))","v":-0.16490002284677716}]
[352,0.99026806874157025,-0.13917310096006588,null,-262,{"$f":"COS(RADIANS(E178))*COS(RADIANS(Sight2!LHA2_))","v":-0.12613348359793183},0.99026806874157025,{"$f":"F178*COS(RADIANS(90-Sight2!LAT2_))-G178*SIN(RADIANS(90-Sight2!LAT2_))","v":-0.7676093890314768},{"$f":"F178*SIN(RADIANS(90-Sight2!LAT2_))+G178*COS(RADIANS(90-Sight2!LAT2_))","v":0.638213388706655},null,{"$f":"COS(RADIANS(E178))*COS(RADIANS(Sight2!AZ_nord2-180))","v":-0.12660946959036612},null,null,null,null,null,null,null,null,352,{"$f":"COS(RADIANS(Sight2!DEC2_))*COS(RADIANS(T178))","v":0.92388446473740615},{"$f":"COS(RADIANS(Sight2!DEC2_))*SIN(RADIANS(T178))","v":-0.12984349384276761},null,null,null,null,352,{"$f":"COS(RADIANS(Sight2!HC2_))*COS(RADIANS(AA178))","v":0.9403797342067749},{"$f":"COS(RADIANS(Sight2!HC2_))*SIN(RADIANS(AA178))","v":-0.13216175278263359}]
[354,0.99452189536827329,-0.10452846326765342,null,-264,{"$f":"COS(RADIANS(E179))*COS(RADIANS(Sight2!LHA2_))","v":-9.4734823871394022E-2},0.9945218953682734,{"$f":"F179*COS(RADIANS(90-Sight2!LAT2_))-G179*SIN(RADIANS(90-Sight2!LAT2_))","v":-0.7475469657979944},{"$f":"F179*SIN(RADIANS(90-Sight2!LAT2_))+G179*COS(RADIANS(90-Sight2!LAT2_))","v":0.66273827499779969},null,{"$f":"COS(RADIANS(E179))*COS(RADIANS(Sight2!AZ_nord2-180))","v":-9.5092321721070891E-2},null,null,null,null,null,null,null,null,354,{"$f":"COS(RADIANS(Sight2!DEC2_))*COS(RADIANS(T179))","v":0.92785313186921781},{"$f":"COS(RADIANS(Sight2!DEC2_))*SIN(RADIANS(T179))","v":-9.7521293863976954E-2},null,null,null,null,354,{"$f":"COS(RADIANS(Sight2!HC2_))*COS(RADIANS(AA179))","v":0.94441925893634049},{"$f":"COS(RADIANS(Sight2!HC2_))*SIN(RADIANS(AA179))","v":-9.9262463980680893E-2}]
[356,0.9975640502598242,-6.9756473744125636E-2,null,-266,{"$f":"COS(RADIANS(E180))*COS(RADIANS(Sight2!LHA2_))","v":-6.3220744354750669E-2},0.9975640502598242,{"$f":"F180*COS(RADIANS(90-Sight2!LAT2_))-G180*SIN(RADIANS(90-Sight2!LAT2_))","v":-0.72657377173747006},{"$f":"F180*SIN(RADIANS(90-Sight2!LAT2_))+G180*COS(RADIANS(90-Sight2!LAT2_))","v":0.68645571678786421},null,{"$f":"COS(RADIANS(E180))*COS(RADIANS(Sight2!AZ_nord2-180))","v":-6.3459318505608611E-2},null,null,null,null,null,null,null,null,356,{"$f":"COS(RADIANS(Sight2!DEC2_))*COS(RADIANS(T180))","v":0.9306913528846652},{"$f":"COS(RADIANS(Sight2!DEC2_))*SIN(RADIANS(T180))","v":-6.5080279210617584E-2},null,null,null,null,356,{"$f":"COS(RADIANS(Sight2!HC2_))*COS(RADIANS(AA180))","v":0.94730815427552673},{"$f":"COS(RADIANS(Sight2!HC2_))*SIN(RADIANS(AA180))","v":-6.6242239156579022E-2}]
[358,0.99939082701909576,-3.4899496702500823E-2,null,-268,{"$f":"COS(RADIANS(E181))*COS(RADIANS(Sight2!LHA2_))","v":-3.1629640099519366E-2},0.99939082701909576,{"$f":"F181*COS(RADIANS(90-Sight2!LAT2_))-G181*SIN(RADIANS(90-Sight2!LAT2_))","v":-0.70471535945619301},{"$f":"F181*SIN(RADIANS(90-Sight2!LAT2_))+G181*COS(RADIANS(90-Sight2!LAT2_))","v":0.70933681802742055},null,{"$f":"COS(RADIANS(E181))*COS(RADIANS(Sight2!AZ_nord2-180))","v":-3.1748999885705093E-2},null,null,null,null,null,null,null,null,358,{"$f":"COS(RADIANS(Sight2!DEC2_))*COS(RADIANS(T181))","v":0.93239566984863542},{"$f":"COS(RADIANS(Sight2!DEC2_))*SIN(RADIANS(T181))","v":-3.2559974261887781E-2},null,null,null,null,358,{"$f":"COS(RADIANS(Sight2!HC2_))*COS(RADIANS(AA181))","v":0.94904290055036311},{"$f":"COS(RADIANS(Sight2!HC2_))*SIN(RADIANS(AA181))","v":-3.3141308367898754E-2}]
[360,1,-2.45029690981724E-16,null,-270,{"$f":"COS(RADIANS(E182))*COS(RADIANS(Sight2!LHA2_))","v":-1.6655399801710524E-16},1,{"$f":"F182*COS(RADIANS(90-Sight2!LAT2_))-G182*SIN(RADIANS(90-Sight2!LAT2_))","v":-0.68199836006249859},{"$f":"F182*SIN(RADIANS(90-Sight2!LAT2_))+G182*COS(RADIANS(90-Sight2!LAT2_))","v":0.73135370161917035},null,{"$f":"COS(RADIANS(E182))*COS(RADIANS(Sight2!AZ_nord2-180))","v":-1.67182517643922E-16},null,null,null,null,null,null,null,null,360,{"$f":"COS(RADIANS(Sight2!DEC2_))*COS(RADIANS(T182))","v":0.93296400631343779},{"$f":"COS(RADIANS(Sight2!DEC2_))*SIN(RADIANS(T182))","v":-2.2860388216405288E-16},null,null,null,null,360,{"$f":"COS(RADIANS(Sight2!HC2_))*COS(RADIANS(AA182))","v":0.94962138423973086},{"$f":"COS(RADIANS(Sight2!HC2_))*SIN(RADIANS(AA182))","v":-2.3268543432989823E-16}]

{"sheet":"CALC3","index":7,"n_rows":182,"n_cols":48,"rows_kept":182,"cut":false,"hidden":true,"merged":[]}
["Plot of local meridian circle",null,null,null,"Plot of LHA meridian",null,null,null,null,null,"Plot of North AZIMUT",null,null,"Plot of the EQUATOR",null,null,"South Pole view",null,null,"Declination circle",null,null,null,"Zenith view",null,null,"Altitude circle",null,null,null,"Plot of circle of position (COP3) for body 3",null,null,null,null,null,"slope and offset for linear approx. at Lat or Lon near intersection (n=0: x=my+b; n=1: y=mx+b)"]
[0,{"$f":"COS(RADIANS(A2))","v":1},{"$f":"SIN(RADIANS(A2))","v":0},null,90,{"$f":"COS(RADIANS(E2))*COS(RADIANS(Sight3!LHA3_))","v":5.8259378151967171E-17},{"$f":"SIN(RADIANS(E2))","v":1},{"$f":"F2*COS(RADIANS(90-Sight3!LAT3_))-G2*SIN(RADIANS(90-Sight3!LAT3_))","v":-0.68199836006249848},{"$f":"F2*SIN(RADIANS(90-Sight3!LAT3_))+G2*COS(RADIANS(90-Sight3!LAT3_))","v":0.73135370161917046},null,{"$f":"COS(RADIANS(E2))*COS(RADIANS(Sight3!AZ_nord3-180))","v":5.4256691169793224E-17},null,null,{"$f":"1.1*COS(RADIANS(90-Sight3!LAT3_))","v":0.80448907178108753},{"$f":"1.1*SIN(RADIANS(90-Sight3!LAT3_))","v":0.75019819606874838},null,0,0,null,0,{"$f":"COS(RADIANS(Sight3!DEC3_))*COS(RADIANS(T2))","v":0.98813921066007604},{"$f":"COS(RADIANS(Sight3!DEC3_))*SIN(RADIANS(T2))","v":0},null,0,0,null,0,{"$f":"COS(RADIANS(Sight3!HC3_))*COS(RADIANS(AA2))","v":0.65775236534226078},{"$f":"COS(RADIANS(Sight3!HC3_))*SIN(RADIANS(AA2))","v":0},null,"Azimut from body to PLOP3 (great circle)",null,null,null,null,null,"m","b","n"]
[{"$f":"SUM(A2+2)","v":2},0.99939082701909576,3.4899496702500969E-2,null,{"$f":"SUM(E2-2)","v":88},{"$f":"COS(RADIANS(E3))*COS(RADIANS(Sight3!LHA3_))","v":3.3191454758941738E-2},{"$f":"SIN(RADIANS(E3))","v":0.99939082701909576},{"$f":"F3*COS(RADIANS(90-Sight3!LAT3_))-G3*SIN(RADIANS(90-Sight3!LAT3_))","v":-0.65730821178845011},{"$f":"F3*SIN(RADIANS(90-Sight3!LAT3_))+G3*COS(RADIANS(90-Sight3!LAT3_))","v":0.7535446984183467},null,{"$f":"COS(RADIANS(E3))*COS(RADIANS(Sight3!AZ_nord3-180))","v":3.0911049301532208E-2},null,null,{"$f":"1.1*COS(RADIANS(270-Sight3!LAT3_))","v":-0.80448907178108764},{"$f":"1.1*SIN(RADIANS(270-Sight3!LAT3_))","v":-0.75019819606874827},null,null,null,null,{"$f":"SUM(T2+2)","v":2},{"$f":"COS(RADIANS(Sight3!DEC3_))*COS(RADIANS(T3))","v":0.98753726295156985},{"$f":"COS(RADIANS(Sight3!DEC3_))*SIN(RADIANS(T3))","v":3.4485561124043232E-2},null,null,null,null,{"$f":"SUM(AA2+2)","v":2},{"$f":"COS(RADIANS(Sight3!HC3_))*COS(RADIANS(AA3))","v":0.65735168037316838},{"$f":"COS(RADIANS(Sight3!HC3_))*SIN(RADIANS(AA3))","v":2.2955226505324444E-2},null,"acos","AZ(deg)",null,null,null,"LOP3:",-0.36655749183607805,73.020528908686444,1]
[4,0.9975640502598242,6.9756473744125302E-2,null,86,{"$f":"COS(RADIANS(E4))*COS(RADIANS(Sight3!LHA3_))","v":6.6342470843011106E-2},0.9975640502598242,{"$f":"F4*COS(RADIANS(90-Sight3!LAT3_))-G4*SIN(RADIANS(90-Sight3!LAT3_))","v":-0.63181723470890583},{"$f":"F4*SIN(RADIANS(90-Sight3!LAT3_))+G4*COS(RADIANS(90-Sight3!LAT3_))","v":0.77481761707716235},null,{"$f":"COS(RADIANS(E4))*COS(RADIANS(Sight3!AZ_nord3-180))","v":6.1784438250972379E-2},null,null,null,null,null,"Zénith",null,null,4,{"$f":"COS(RADIANS(Sight3!DEC3_))*COS(RADIANS(T4))","v":0.98573215320661112},{"$f":"COS(RADIANS(Sight3!DEC3_))*SIN(RADIANS(T4))","v":6.8929106903950293E-2},null,"North Pole",null,null,4,{"$f":"COS(RADIANS(Sight3!HC3_))*COS(RADIANS(AA4))","v":0.65615011363880527},{"$f":"COS(RADIANS(Sight3!HC3_))*SIN(RADIANS(AA4))","v":4.5882485603133731E-2},null,{"$f":"ACOS(IF(AG4>0,IF((ABS(1-AG4))<0.000000000001,1,AG4),IF((ABS(1+AG4))<0.000000000001,-1,AG4)))","v":0.32615362966011885},{"$f":"DEGREES(AE4)","v":18.687226452397677},{"$f":"(SIN(RADIANS(LatLP3))-(SIN(RADIANS(LatB3))*SIN(RADIANS(Sight3!HO3_))))/(COS(RADIANS(LatB3))*COS(RADIANS(Sight3!HO3_)))","v":0.94728173181460862}]
[6,0.99452189536827329,0.10452846326765347,null,84,{"$f":"COS(RADIANS(E5))*COS(RADIANS(Sight3!LHA3_))","v":9.941265884563269E-2},0.99452189536827329,{"$f":"F5*COS(RADIANS(90-Sight3!LAT3_))-G5*SIN(RADIANS(90-Sight3!LAT3_))","v":-0.60555648565285281},{"$f":"F5*SIN(RADIANS(90-Sight3!LAT3_))+G5*COS(RADIANS(90-Sight3!LAT3_))","v":0.79514653982107419},null,{"$f":"COS(RADIANS(E5))*COS(RADIANS(Sight3!AZ_nord3-180))","v":9.2582552379567071E-2},null,null,"Plot of POLES",null,null,0,{"$f":"COS(RADIANS(Sight3!LAT3_))","v":0.68199836006249848},null,6,{"$f":"COS(RADIANS(Sight3!DEC3_))*COS(RADIANS(T5))","v":0.98272608067336831},{"$f":"COS(RADIANS(Sight3!DEC3_))*SIN(RADIANS(T5))","v":0.10328867318480986},null,0,{"$f":"COS(RADIANS(Sight3!LAT3_))","v":0.68199836006249848},null,6,{"$f":"COS(RADIANS(Sight3!HC3_))*COS(RADIANS(AA5))","v":0.65414912906315015},{"$f":"COS(RADIANS(Sight3!HC3_))*SIN(RADIANS(AA5))","v":6.875384395989069E-2},null,"Azimut North from body to PLOP3 (rad-deg)"]
[8,0.99026806874157036,0.13917310096006544,null,82,{"$f":"COS(RADIANS(E6))*COS(RADIANS(Sight3!LHA3_))","v":0.13236172783679706},0.99026806874157036,{"$f":"F6*COS(RADIANS(90-Sight3!LAT3_))-G6*SIN(RADIANS(90-Sight3!LAT3_))","v":-0.5785579592978578},{"$f":"F6*SIN(RADIANS(90-Sight3!LAT3_))+G6*COS(RADIANS(90-Sight3!LAT3_))","v":0.81450669898914896},null,{"$f":"COS(RADIANS(E6))*COS(RADIANS(Sight3!AZ_nord3-180))","v":0.12326786892933617},null,null,{"$f":"1.1*COS(RADIANS(180-Sight3!LAT3_))","v":-0.75019819606874827},{"$f":"1.1*SIN(RADIANS(180-Sight3!LAT3_))","v":0.80448907178108764},null,null,null,null,8,{"$f":"COS(RADIANS(Sight3!DEC3_))*COS(RADIANS(T6))","v":0.9785227077881733},{"$f":"COS(RADIANS(Sight3!DEC3_))*SIN(RADIANS(T6))","v":0.13752239812779413},null,null,null,null,8,{"$f":"COS(RADIANS(Sight3!HC3_))*COS(RADIANS(AA6))","v":0.65135116453768038},{"$f":"COS(RADIANS(Sight3!HC3_))*SIN(RADIANS(AA6))","v":9.1541436348500302E-2},null,{"$f":"IF(AND(LatB3=0,LatLP3=0),IF((LonLP3-LonB3)>0,3*PI()/2,PI()/2),IF(LonLP3=LonB1,IF((LatLP3-LatB3)>0,0,PI()),IF((LonLP3-LonB3)<0,AE4,2*PI()-AE4)))","v":5.9570316775194669},{"$f":"IF(DEGREES(ZB3Nr)>=360,DEGREES(ZB3Nr)-360,IF(LonLP3-LonB3>180,DEGREES(2*PI()-ZB3Nr),IF(LonLP3-LonB3<-180,DEGREES(2*PI()-ZB3Nr),DEGREES(ZB3Nr))))","v":341.31277354760232}]
[10,0.98480775301220802,0.17364817766693033,null,80,{"$f":"COS(RADIANS(E7))*COS(RADIANS(Sight3!LHA3_))","v":0.16514953445135344},0.98480775301220802,{"$f":"F7*COS(RADIANS(90-Sight3!LAT3_))-G7*SIN(RADIANS(90-Sight3!LAT3_))","v":-0.55085454918947985},{"$f":"F7*SIN(RADIANS(90-Sight3!LAT3_))+G7*COS(RADIANS(90-Sight3!LAT3_))","v":0.83287450720964418},null,{"$f":"COS(RADIANS(E7))*COS(RADIANS(Sight3!AZ_nord3-180))","v":0.15380300256877449},null,null,{"$f":"1.1*COS(RADIANS(-Sight3!LAT3_))","v":0.75019819606874838},{"$f":"1.1*SIN(RADIANS(-Sight3!LAT3_))","v":-0.80448907178108753},null,"Zénith line + label",null,"nadir",10,{"$f":"COS(RADIANS(Sight3!DEC3_))*COS(RADIANS(T7))","v":0.97312715571340636},{"$f":"COS(RADIANS(Sight3!DEC3_))*SIN(RADIANS(T7))","v":0.17158857321236118},null,"Z meridian",null,null,10,{"$f":"COS(RADIANS(Sight3!HC3_))*COS(RADIANS(AA7))","v":0.64775962895117678},{"$f":"COS(RADIANS(Sight3!HC3_))*SIN(RADIANS(AA7))","v":0.11421749959779656},null,"D","acosLatv","LatV","cs/sndLov","ifdLov","dLoV","DV","DVx","asindLovx","dLoVx","AzNB-LOP","Latx","DRLatx","GHAx","GHAxcor","DRLonx","linLat3","linLon3"]
[12,0.97814760073380569,0.20791169081775934,null,78,{"$f":"COS(RADIANS(E8))*COS(RADIANS(Sight3!LHA3_))","v":0.19773613179751648},0.97814760073380558,{"$f":"F8*COS(RADIANS(90-Sight3!LAT3_))-G8*SIN(RADIANS(90-Sight3!LAT3_))","v":-0.52248000766555314},{"$f":"F8*SIN(RADIANS(90-Sight3!LAT3_))+G8*COS(RADIANS(90-Sight3!LAT3_))","v":0.85022758613758742},null,{"$f":"COS(RADIANS(E8))*COS(RADIANS(Sight3!AZ_nord3-180))","v":0.1841507509411191},null,null,null,null,null,0,0,null,12,{"$f":"COS(RADIANS(Sight3!DEC3_))*COS(RADIANS(T8))","v":0.96654599809815001},{"$f":"COS(RADIANS(Sight3!DEC3_))*SIN(RADIANS(T8))","v":0.20544569405166249},null,0,-1,null,12,{"$f":"COS(RADIANS(Sight3!HC3_))*COS(RADIANS(AA8))","v":0.64337889803651804},{"$f":"COS(RADIANS(Sight3!HC3_))*SIN(RADIANS(AA8))","v":0.13675440641769002},null,{"$f":"IF(AO8=0,RADIANS(90-Sight3!HO3_),IF(AO8=180,-RADIANS(90-Sight3!HO3_),IF(AO8<180,-RADIANS(90-Sight3!HO3_),RADIANS(90-Sight3!HO3_))))","v":0.71658701551900095},{"$f":"ACOS(COS(RADIANS(LatB3))*SIN(RADIANS(AO8)))","v":1.9445973138768702},{"$f":"IF(OR(AO8=0,AO8=180),RADIANS((LatLP3+LatB3)/2),IF(AND(LatB3=0,LatLP3=0),0,IF(LatB3>=0,AF8,-AF8)))","v":1.9445973138768702},{"$f":"IF(COS(RADIANS(AO8))/SIN(AG8)>0,IF(1-COS(RADIANS(AO8))/SIN(AG8)<0.000000000001,1,COS(RADIANS(AO8))/SIN(AG8)),IF(1+COS(RADIANS(AO8))/SIN(AG8)<0.000000000001,-1,COS(RADIANS(AO8))/SIN(AG8)))","v":0.998140452549794},{"$f":"IF(AND(AO8<=180,AO8>0),IF(AH8=1,-PI()/2,IF(AH8=-1,PI()/2,-ASIN(AH8))),IF(AH8=1,PI()/2,IF(AH8=-1,-PI()/2,ASIN(AH8))))","v":1.5098024901289664},{"$f":"IF(OR(OR(AO8=0,AO8=180),AND(LatB3<>LatLP3,OR(AO8=90,AO8=270))),0,IF(AND(LatB3=0,LatLP3=0),RADIANS((LonLP3-LonB3)/2),AI8))","v":1.5098024901289664},{"$f":"IF(AJ8=0,AG8-RADIANS(LatB3),ASIN(COS(RADIANS(LatB3))*SIN(AJ8)))","v":1.405087729239858},{"$f":"AE8-AK8","v":-0.68850071372085708},{"$f":"ASIN(SIN(AL8)/COS(RADIANS(AP8)))","v":-1.153120770005756},{"$f":"IF(AL8>PI()/2,PI()-AM8,IF(AL8<-PI()/2,-PI()-AM8,AM8))","v":-1.153120770005756},{"$f":"IF(AO9-dZB3_<0,360+(AO9-dZB3_),IF(AO9-dZB3_>=360,AO9-dZB3_-360,AO9-dZB3_))","v":338.31277354760249},{"$f":"IF(OR(AO8=0,AO8=180),LatB3+DEGREES(AE8),DEGREES(ASIN(SIN(AG8)*COS(AL8))))","v":45.961769149525374},{"$f":"DRLat3+AP8","v":45.961769149525374},{"$f":"IF(OR(LatB3=90,LatB3=-90),AR9-dZB3_,IF(OR(AO8=0,AO8=180),LonB3,LonB3+DEGREES(AJ8)+DEGREES(AN8)))","v":73.640014632193044},{"$f":"IF(AR8<0,360+AR8,AR8)","v":73.640014632193044},{"$f":"IF(AS8-GHAx3>180,cLOP3+(AS8-GHAx3-360),IF(AS8-GHAx3<-180,cLOP3+(AS8-GHAx3+360),cLOP3+(AS8-GHAx3)))","v":73.640014632193044},46.027229846337676]
[14,0.97029572627599647,0.24192189559966773,null,76,{"$f":"COS(RADIANS(E9))*COS(RADIANS(Sight3!LHA3_))","v":0.23008181812600018},0.97029572627599647,{"$f":"F9*COS(RADIANS(90-Sight3!LAT3_))-G9*SIN(RADIANS(90-Sight3!LAT3_))","v":-0.49346890473416155},{"$f":"F9*SIN(RADIANS(90-Sight3!LAT3_))+G9*COS(RADIANS(90-Sight3!LAT3_))","v":0.86654479371934157},null,{"$f":"COS(RADIANS(E9))*COS(RADIANS(Sight3!AZ_nord3-180))","v":0.21427413998969042},null,null,"Plot of Declination",null,null,0,1,null,14,{"$f":"COS(RADIANS(Sight3!DEC3_))*COS(RADIANS(T9))","v":0.95878725306920831},{"$f":"COS(RADIANS(Sight3!DEC3_))*SIN(RADIANS(T9))","v":0.23905251095924498},null,0,1,null,14,{"$f":"COS(RADIANS(Sight3!HC3_))*COS(RADIANS(AA9))","v":0.63821430903952348},{"$f":"COS(RADIANS(Sight3!HC3_))*SIN(RADIANS(AA9))","v":0.15912469905876492},null,{"$f":"IF(AO9=0,RADIANS(90-Sight3!HO3_),IF(AO9=180,-RADIANS(90-Sight3!HO3_),IF(AO9<180,-RADIANS(90-Sight3!HO3_),RADIANS(90-Sight3!HO3_))))","v":0.71658701551900095},1.9411544066511262,1.9411544066511262,{"$f":"IF(COS(RADIANS(AO9))/SIN(AG9)>0,IF(1-COS(RADIANS(AO9))/SIN(AG9)<0.000000000001,1,COS(RADIANS(AO9))/SIN(AG9)),IF(1+COS(RADIANS(AO9))/SIN(AG9)<0.000000000001,-1,COS(RADIANS(AO9))/SIN(AG9)))","v":0.99817791264375344},{"$f":"IF(AND(AO9<=180,AO9>0),IF(AH9=1,-PI()/2,IF(AH9=-1,PI()/2,-ASIN(AH9))),IF(AH9=1,PI()/2,IF(AH9=-1,-PI()/2,ASIN(AH9))))","v":1.5104201566781075},1.5104201566781075,1.4053122843865031,{"$f":"AE9-AK9","v":-0.68872526886750218},-1.1565507140567415,{"$f":"IF(AL9>PI()/2,PI()-AM9,IF(AL9<-PI()/2,-PI()-AM9,AM9))","v":-1.1565507140567415},338.51277354760248,46.030513902789558,46.030513902789558,73.478883000517769,{"$f":"IF(AR9<0,360+AR9,AR9)","v":73.478883000517769},73.478883000517769,46.086293853100017]
[16,0.96126169593831889,0.27563735581699916,null,74,{"$f":"COS(RADIANS(E10))*COS(RADIANS(Sight3!LHA3_))","v":0.26214718520048469},0.96126169593831889,{"$f":"F10*COS(RADIANS(90-Sight3!LAT3_))-G10*SIN(RADIANS(90-Sight3!LAT3_))","v":-0.46385658595540885},{"$f":"F10*SIN(RADIANS(90-Sight3!LAT3_))+G10*COS(RADIANS(90-Sight3!LAT3_))","v":0.88180624995094159},null,{"$f":"COS(RADIANS(E10))*COS(RADIANS(Sight3!AZ_nord3-180))","v":0.24413646900508545},null,null,{"$f":"COS(RADIANS(Sight3!DEC3_+90-Sight3!LAT3_))","v":0.61795109772107326},{"$f":"SIN(RADIANS(Sight3!DEC3_+90-Sight3!LAT3_))","v":0.78621653558375415},null,0,1.1000000000000001,-1.1000000000000001,16,{"$f":"COS(RADIANS(Sight3!DEC3_))*COS(RADIANS(T10))","v":0.94986037346225649},{"$f":"COS(RADIANS(Sight3!DEC3_))*SIN(RADIANS(T10))","v":0.27236807920544009},null,null,null,null,16,{"$f":"COS(RADIANS(Sight3!HC3_))*COS(RADIANS(AA10))","v":0.63227215421634231},{"$f":"COS(RADIANS(Sight3!HC3_))*SIN(RADIANS(AA10))","v":0.18130112276531757},null,{"$f":"IF(AO10=0,RADIANS(90-Sight3!HO3_),IF(AO10=180,-RADIANS(90-Sight3!HO3_),IF(AO10<180,-RADIANS(90-Sight3!HO3_),RADIANS(90-Sight3!HO3_))))","v":0.71658701551900095},1.9377113710437861,1.9377113710437861,0.99821489342327374,1.5110361740071805,1.5110361740071805,1.4055342628242373,-0.68894724730523638,-1.1599905237350281,-1.1599905237350281,338.71277354760247,46.098736240642928,46.098736240642928,73.317091616686483,73.317091616686483,73.317091616686483,46.145599696957902]
[18,0.95105651629515353,0.3090169943749474,null,72,{"$f":"COS(RADIANS(E11))*COS(RADIANS(Sight3!LHA3_))","v":0.29389316631048068},0.95105651629515353,{"$f":"F11*COS(RADIANS(90-Sight3!LAT3_))-G11*SIN(RADIANS(90-Sight3!LAT3_))","v":-0.43367912937829911},{"$f":"F11*SIN(RADIANS(90-Sight3!LAT3_))+G11*COS(RADIANS(90-Sight3!LAT3_))","v":0.89599336109881633},null,{"$f":"COS(RADIANS(E11))*COS(RADIANS(Sight3!AZ_nord3-180))","v":0.27370135533933798},null,null,{"$f":"COS(RADIANS(270-Sight3!DEC3_-Sight3!LAT3_))","v":-0.82740744114151044},{"$f":"SIN(RADIANS(270-Sight3!DEC3_-Sight3!LAT3_))","v":-0.56160210678349309},null,null,null,null,18,{"$f":"COS(RADIANS(Sight3!DEC3_))*COS(RADIANS(T11))","v":0.93977623530501475},{"$f":"COS(RADIANS(Sight3!DEC3_))*SIN(RADIANS(T11))","v":0.3053518089022097},null,"Azimut line + label",null,null,18,{"$f":"COS(RADIANS(Sight3!HC3_))*COS(RADIANS(AA11))","v":0.62555967316730765},{"$f":"COS(RADIANS(Sight3!HC3_))*SIN(RADIANS(AA11))","v":0.20325665898107775},null,{"$f":"IF(AO11=0,RADIANS(90-Sight3!HO3_),IF(AO11=180,-RADIANS(90-Sight3!HO3_),IF(AO11<180,-RADIANS(90-Sight3!HO3_),RADIANS(90-Sight3!HO3_))))","v":0.71658701551900095},1.9342682087007361,1.9342682087007361,0.99825139916291883,1.5116505631993025,1.5116505631993025,1.4057536799714418,-0.6891666644524409,-1.1634401824919931,-1.1634401824919931,338.91277354760246,46.166433486813652,46.166433486813652,73.154642636839085,73.154642636839085,73.154642636839085,46.205146587562098]
[20,0.93969262078590843,0.34202014332566871,null,70,{"$f":"COS(RADIANS(E12))*COS(RADIANS(Sight3!LHA3_))","v":0.32528108386809923},0.93969262078590832,{"$f":"F12*COS(RADIANS(90-Sight3!LAT3_))-G12*SIN(RADIANS(90-Sight3!LAT3_))","v":-0.40297330158519051},{"$f":"F12*SIN(RADIANS(90-Sight3!LAT3_))+G12*COS(RADIANS(90-Sight3!LAT3_))","v":0.90908884235338916},null,{"$f":"COS(RADIANS(E12))*COS(RADIANS(Sight3!AZ_nord3-180))","v":0.3029327787325713},null,null,null,null,null,"LHA line + label",null,null,20,{"$f":"COS(RADIANS(Sight3!DEC3_))*COS(RADIANS(T12))","v":0.92854712456648569},{"$f":"COS(RADIANS(Sight3!DEC3_))*SIN(RADIANS(T12))","v":0.33796351445567235},null,0,0,null,20,{"$f":"COS(RADIANS(Sight3!HC3_))*COS(RADIANS(AA12))","v":0.61808504401659936},{"$f":"COS(RADIANS(Sight3!HC3_))*SIN(RADIANS(AA12))","v":0.22496455826715764},null,{"$f":"IF(AO12=0,RADIANS(90-Sight3!HO3_),IF(AO12=180,-RADIANS(90-Sight3!HO3_),IF(AO12<180,-RADIANS(90-Sight3!HO3_),RADIANS(90-Sight3!HO3_))))","v":0.71658701551900095},1.9308249212532396,1.9308249212532396,0.99828743406703557,1.5122633451520653,1.5122633451520653,1.4059705510230058,-0.68938353550400489,-1.1668996722930922,-1.1668996722930922,339.11277354760244,46.233602969716934,46.233602969716934,72.99153829162266,72.99153829162266,72.99153829162266,46.26493370725219]
[22,0.92718385456678742,0.37460659341591201,null,68,{"$f":"COS(RADIANS(E13))*COS(RADIANS(Sight3!LHA3_))","v":0.35627269653073412},0.92718385456678742,{"$f":"F13*COS(RADIANS(90-Sight3!LAT3_))-G13*SIN(RADIANS(90-Sight3!LAT3_))","v":-0.37177651289737934},{"$f":"F13*SIN(RADIANS(90-Sight3!LAT3_))+G13*COS(RADIANS(90-Sight3!LAT3_))","v":0.92107673888795549},null,{"$f":"COS(RADIANS(E13))*COS(RADIANS(Sight3!AZ_nord3-180))","v":0.33179512519813614},null,null,"Plot of Calculated ALTITUDE",null,null,0,0,null,22,{"$f":"COS(RADIANS(Sight3!DEC3_))*COS(RADIANS(T13))","v":0.91618672218839203},{"$f":"COS(RADIANS(Sight3!DEC3_))*SIN(RADIANS(T13))","v":0.37016346352605933},null,{"$f":"COS(RADIANS(90-Sight3!AZ_nord3))","v":0.46422713004601385},{"$f":"SIN(RADIANS(90-Sight3!AZ_nord3))","v":-0.88571619141192248},null,22,{"$f":"COS(RADIANS(Sight3!HC3_))*COS(RADIANS(AA13))","v":0.60985737344845914},{"$f":"COS(RADIANS(Sight3!HC3_))*SIN(RADIANS(AA13))","v":0.24639837289212271},null,{"$f":"IF(AO13=0,RADIANS(90-Sight3!HO3_),IF(AO13=180,-RADIANS(90-Sight3!HO3_),IF(AO13<180,-RADIANS(90-Sight3!HO3_),RADIANS(90-Sight3!HO3_))))","v":0.71658701551900095},1.9273815103181779,1.9273815103181779,0.99832300227082571,1.5128745405805653,1.5128745405805653,1.4061848909530026,-0.68959787543400164,-1.1703689736105336,-1.1703689736105336,339.31277354760243,46.300242022808007,46.300242022808007,72.827780886784822,72.827780886784822,72.827780886784822,46.324960210839137]
[24,0.91354545764260087,0.40673664307580021,null,66,{"$f":"COS(RADIANS(E14))*COS(RADIANS(Sight3!LHA3_))","v":0.38683024579224845},0.91354545764260087,{"$f":"F14*COS(RADIANS(90-Sight3!LAT3_))-G14*SIN(RADIANS(90-Sight3!LAT3_))","v":-0.34012677179638406},{"$f":"F14*SIN(RADIANS(90-Sight3!LAT3_))+G14*COS(RADIANS(90-Sight3!LAT3_))","v":0.93194244529718184},null,{"$f":"COS(RADIANS(E14))*COS(RADIANS(Sight3!AZ_nord3-180))","v":0.3602532304127683},null,null,{"$f":"COS(RADIANS(Sight3!HC3_))","v":0.65775236534226078},{"$f":"SIN(RADIANS(Sight3!HC3_))","v":0.75323424370288761},null,{"$f":"COS(RADIANS(90+Sight3!LHA3_))","v":0.30901161450707298},{"$f":"SIN(RADIANS(90+Sight3!LHA3_))","v":0.95105826430336649},null,24,{"$f":"COS(RADIANS(Sight3!DEC3_))*COS(RADIANS(T14))","v":0.90271008741705761},{"$f":"COS(RADIANS(Sight3!DEC3_))*SIN(RADIANS(T14))","v":0.4019124254354503},null,{"$f":"1.1*COS(RADIANS(90-Sight3!AZ_nord3))","v":0.51064984305061523},{"$f":"1.1*SIN(RADIANS(90-Sight3!AZ_nord3))","v":-0.97428781055311486},null,24,{"$f":"COS(RADIANS(Sight3!HC3_))*COS(RADIANS(AA14))","v":0.60088668561209879},{"$f":"COS(RADIANS(Sight3!HC3_))*SIN(RADIANS(AA14))","v":0.26753198905447845},null,{"$f":"IF(AO14=0,RADIANS(90-Sight3!HO3_),IF(AO14=180,-RADIANS(90-Sight3!HO3_),IF(AO14<180,-RADIANS(90-Sight3!HO3_),RADIANS(90-Sight3!HO3_))))","v":0.71658701551900095},1.9239379774982865,1.9239379774982865,0.998358107841395,1.5134841700203765,1.5134841700203765,1.4063967145173233,-0.68980969899832234,-1.1738480654161496,-1.1738480654161496,339.51277354760242,46.366347984938749,46.366347984938749,72.663372803752594,72.663372803752594,72.663372803752594,46.385225225393008]
[26,0.89879404629916704,0.4383711467890774,null,64,{"$f":"COS(RADIANS(E15))*COS(RADIANS(Sight3!LHA3_))","v":0.4169165019858963},0.89879404629916704,{"$f":"F15*COS(RADIANS(90-Sight3!LAT3_))-G15*SIN(RADIANS(90-Sight3!LAT3_))","v":-0.30806263861646771},{"$f":"F15*SIN(RADIANS(90-Sight3!LAT3_))+G15*COS(RADIANS(90-Sight3!LAT3_))","v":0.94167272339154251},null,{"$f":"COS(RADIANS(E15))*COS(RADIANS(Sight3!AZ_nord3-180))","v":0.38827242255889854},null,null,{"$f":"COS(RADIANS(180-Sight3!HC3_))","v":-0.657752365342261},{"$f":"SIN(RADIANS(180-Sight3!HC3_))","v":0.75323424370288738},null,{"$f":"1.1*COS(RADIANS(90+Sight3!LHA3_))","v":0.3399127759577803},{"$f":"1.1*SIN(RADIANS(90+Sight3!LHA3_))","v":1.0461640907337033},null,26,{"$f":"COS(RADIANS(Sight3!DEC3_))*COS(RADIANS(T15))","v":0.88813363945603474},{"$f":"COS(RADIANS(Sight3!DEC3_))*SIN(RADIANS(T15))","v":0.43317171896431128},null,null,null,null,26,{"$f":"COS(RADIANS(Sight3!HC3_))*COS(RADIANS(AA15))","v":0.59118390990881853},{"$f":"COS(RADIANS(Sight3!HC3_))*SIN(RADIANS(AA15))","v":0.28833965869831507},null,{"$f":"IF(AO15=0,RADIANS(90-Sight3!HO3_),IF(AO15=180,-RADIANS(90-Sight3!HO3_),IF(AO15<180,-RADIANS(90-Sight3!HO3_),RADIANS(90-Sight3!HO3_))))","v":0.71658701551900095},1.9204943243823882,1.9204943243823882,0.99839275477878253,1.514092253830513,1.514092253830513,1.4066060362562689,-0.69001902073726795,-1.1773369251744616,-1.1773369251744616,339.71277354760241,46.431918200718066,46.431918200718066,72.498316500199323,72.498316500199323,72.498316500199323,46.445727850035226]
[28,0.88294759285892699,0.46947156278589081,null,62,{"$f":"COS(RADIANS(E16))*COS(RADIANS(Sight3!LHA3_))","v":0.44649480964293831},0.88294759285892688,{"$f":"F16*COS(RADIANS(90-Sight3!LAT3_))-G16*SIN(RADIANS(90-Sight3!LAT3_))","v":-0.27562317856480895},{"$f":"F16*SIN(RADIANS(90-Sight3!LAT3_))+G16*COS(RADIANS(90-Sight3!LAT3_))","v":0.95025571832601385},null,{"$f":"COS(RADIANS(E16))*COS(RADIANS(Sight3!AZ_nord3-180))","v":0.41581856456692257},null,null,null,null,null,null,null,null,28,{"$f":"COS(RADIANS(Sight3!DEC3_))*COS(RADIANS(T16))","v":0.87247513746183436},{"$f":"COS(RADIANS(Sight3!DEC3_))*SIN(RADIANS(T16))","v":0.46390325947860245},null,null,null,null,28,{"$f":"COS(RADIANS(Sight3!HC3_))*COS(RADIANS(AA16))","v":0.58076086767621471},{"$f":"COS(RADIANS(Sight3!HC3_))*SIN(RADIANS(AA16))","v":0.30879603088334739},null,{"$f":"IF(AO16=0,RADIANS(90-Sight3!HO3_),IF(AO16=180,-RADIANS(90-Sight3!HO3_),IF(AO16<180,-RADIANS(90-Sight3!HO3_),RADIANS(90-Sight3!HO3_))))","v":0.71658701551900095},1.917050552545623,1.917050552545623,0.99842694701696633,1.5146988121963036,1.5146988121963036,1.4068128704970799,-0.69022585497807898,-1.1808355288359393,-1.1808355288359393,339.9127735476024,46.496950020876817,46.496950020876817,72.332614510595818,72.332614510595818,72.332614510595818,46.506467155736537]
[30,0.86602540378443871,0.49999999999999994,null,60,{"$f":"COS(RADIANS(E17))*COS(RADIANS(Sight3!LHA3_))","v":0.47552913215168335},0.8660254037844386,{"$f":"F17*COS(RADIANS(90-Sight3!LAT3_))-G17*SIN(RADIANS(90-Sight3!LAT3_))","v":-0.24284791412656492},{"$f":"F17*SIN(RADIANS(90-Sight3!LAT3_))+G17*COS(RADIANS(90-Sight3!LAT3_))","v":0.95768097304337707},null,{"$f":"COS(RADIANS(E17))*COS(RADIANS(Sight3!AZ_nord3-180))","v":0.44285809570596141},null,null,"Zénith",null,null,"Greenwich line + label",null,null,30,{"$f":"COS(RADIANS(Sight3!DEC3_))*COS(RADIANS(T17))","v":0.85575365890712884},{"$f":"COS(RADIANS(Sight3!DEC3_))*SIN(RADIANS(T17))","v":0.49406960533003796},null,"Cardinal points",null,null,30,{"$f":"COS(RADIANS(Sight3!HC3_))*COS(RADIANS(AA17))","v":0.56963025778570109},{"$f":"COS(RADIANS(Sight3!HC3_))*SIN(RADIANS(AA17))","v":0.32887618267113033},null,{"$f":"IF(AO17=0,RADIANS(90-Sight3!HO3_),IF(AO17=180,-RADIANS(90-Sight3!HO3_),IF(AO17<180,-RADIANS(90-Sight3!HO3_),RADIANS(90-Sight3!HO3_))))","v":0.71658701551900095},1.913606663549674,1.913606663549674,0.99846068842485014,1.5153038651322601,1.5153038651322601,1.4070172313564324,-0.69043021583743147,-1.1843438508304971,-1.1843438508304971,340.11277354760239,46.561440802636064,46.561440802636064,72.166269446747037,72.166269446747037,72.166269446747037,46.567442185120257]
[32,0.84804809615642596,0.5299192642332049,null,58,{"$f":"COS(RADIANS(E18))*COS(RADIANS(Sight3!LHA3_))","v":0.50398409566254887},0.84804809615642596,{"$f":"F18*COS(RADIANS(90-Sight3!LAT3_))-G18*SIN(RADIANS(90-Sight3!LAT3_))","v":-0.20977677691281127},{"$f":"F18*SIN(RADIANS(90-Sight3!LAT3_))+G18*COS(RADIANS(90-Sight3!LAT3_))","v":0.96393944101453211},null,{"$f":"COS(RADIANS(E18))*COS(RADIANS(Sight3!AZ_nord3-180))","v":0.46935807247244249},null,null,0,1.2,null,0,0,null,32,{"$f":"COS(RADIANS(Sight3!DEC3_))*COS(RADIANS(T18))","v":0.83798957633779103},{"$f":"COS(RADIANS(Sight3!DEC3_))*SIN(RADIANS(T18))","v":0.5236340034729674},null,-1.1499999999999999,0,"W",32,{"$f":"COS(RADIANS(Sight3!HC3_))*COS(RADIANS(AA18))","v":0.55780564117089015},{"$f":"COS(RADIANS(Sight3!HC3_))*SIN(RADIANS(AA18))","v":0.34855564948982104},null,{"$f":"IF(AO18=0,RADIANS(90-Sight3!HO3_),IF(AO18=180,-RADIANS(90-Sight3!HO3_),IF(AO18<180,-RADIANS(90-Sight3!HO3_),RADIANS(90-Sight3!HO3_))))","v":0.71658701551900095},1.9101626589429908,1.9101626589429908,0.99849398280722845,1.515907432484876,1.515907432484876,1.4072191327428789,-0.69063211722387796,-1.1878618640611938,-1.1878618640611938,340.31277354760238,46.625387910079446,46.625387910079446,71.999283998313686,71.999283998313686,71.999283998313686,46.628651952271113]
[34,0.82903757255504162,0.5591929034707469,null,56,{"$f":"COS(RADIANS(E19))*COS(RADIANS(Sight3!LHA3_))","v":0.53182503218564836},0.82903757255504174,{"$f":"F19*COS(RADIANS(90-Sight3!LAT3_))-G19*SIN(RADIANS(90-Sight3!LAT3_))","v":-0.17645005901002464},{"$f":"F19*SIN(RADIANS(90-Sight3!LAT3_))+G19*COS(RADIANS(90-Sight3!LAT3_))","v":0.96902349726029913},null,{"$f":"COS(RADIANS(E19))*COS(RADIANS(Sight3!AZ_nord3-180))","v":0.49528620872668472},null,null,null,null,null,{"$f":"COS(RADIANS(90-Sight3!LON3_))","v":0.94666800717181321},{"$f":"SIN(RADIANS(90-Sight3!LON3_))","v":0.32221062086366381},null,34,{"$f":"COS(RADIANS(Sight3!DEC3_))*COS(RADIANS(T19))","v":0.81920453255208436},{"$f":"COS(RADIANS(Sight3!DEC3_))*SIN(RADIANS(T19))","v":0.55256043424229995},null,0,1.1499999999999999,"N",34,{"$f":"COS(RADIANS(Sight3!HC3_))*COS(RADIANS(AA19))","v":0.54530142430568473},{"$f":"COS(RADIANS(Sight3!HC3_))*SIN(RADIANS(AA19))","v":0.36781045494049031},null,{"$f":"IF(AO19=0,RADIANS(90-Sight3!HO3_),IF(AO19=180,-RADIANS(90-Sight3!HO3_),IF(AO19<180,-RADIANS(90-Sight3!HO3_),RADIANS(90-Sight3!HO3_))))","v":0.71658701551900095},1.9067185402610076,1.9067185402610076,0.99852683390573349,1.5165095339354231,1.5165095339354231,1.4074185883592574,-0.69083157284025642,-1.1913895398981942,-1.1913895398981942,340.51277354760236,46.688788714528798,46.688788714528798,71.831660933318346,71.831660933318346,71.831660933318346,46.690095442549676]
[36,0.80901699437494745,0.58778525229247314,null,54,{"$f":"COS(RADIANS(E20))*COS(RADIANS(Sight3!LHA3_))","v":0.55901802182839588},0.80901699437494745,{"$f":"F20*COS(RADIANS(90-Sight3!LAT3_))-G20*SIN(RADIANS(90-Sight3!LAT3_))","v":-0.14290836389038214},{"$f":"F20*SIN(RADIANS(90-Sight3!LAT3_))+G20*COS(RADIANS(90-Sight3!LAT3_))","v":0.9729269476412814},null,{"$f":"COS(RADIANS(E20))*COS(RADIANS(Sight3!AZ_nord3-180))","v":0.52061091502858536},null,null,"Horizon",null,null,{"$f":"-COS(RADIANS(90-Sight3!LON3_))","v":-0.94666800717181321},{"$f":"-SIN(RADIANS(90-Sight3!LON3_))","v":-0.32221062086366381},null,36,{"$f":"COS(RADIANS(Sight3!DEC3_))*COS(RADIANS(T20))","v":0.79942141423224777},{"$f":"COS(RADIANS(Sight3!DEC3_))*SIN(RADIANS(T20))","v":0.58081365523791806},null,1.1499999999999999,0,"E",36,{"$f":"COS(RADIANS(Sight3!HC3_))*COS(RADIANS(AA20))","v":0.5321328416522082},{"$f":"COS(RADIANS(Sight3!HC3_))*SIN(RADIANS(AA20))","v":0.3866171400086717},null,{"$f":"IF(AO20=0,RADIANS(90-Sight3!HO3_),IF(AO20=180,-RADIANS(90-Sight3!HO3_),IF(AO20<180,-RADIANS(90-Sight3!HO3_),RADIANS(90-Sight3!HO3_))))","v":0.71658701551900095},1.9032743090263613,1.9032743090263613,0.99855924539975938,1.5171101890026439,1.5171101890026439,1.4076156117050354,-0.69102859618603441,-1.1949268481729489,-1.1949268481729489,340.71277354760235,46.751640594924275,46.751640594924275,71.663403098633097,71.663403098633097,71.663403098633097,46.751771612413677]
[38,0.7880107536067219,0.61566147532565829,null,52,{"$f":"COS(RADIANS(E21))*COS(RADIANS(Sight3!LHA3_))","v":0.58552993412167043},0.78801075360672201,{"$f":"F21*COS(RADIANS(90-Sight3!LAT3_))-G21*SIN(RADIANS(90-Sight3!LAT3_))","v":-0.10919255694268526},{"$f":"F21*SIN(RADIANS(90-Sight3!LAT3_))+G21*COS(RADIANS(90-Sight3!LAT3_))","v":0.9756450364044702},null,{"$f":"COS(RADIANS(E21))*COS(RADIANS(Sight3!AZ_nord3-180))","v":0.54530133712448747},null,null,1.3,0,null,{"$f":"1.1*COS(RADIANS(90-Sight3!LON3_))","v":1.0413348078889946},{"$f":"1.1*SIN(RADIANS(90-Sight3!LON3_))","v":0.35443168295003025},null,38,{"$f":"COS(RADIANS(Sight3!DEC3_))*COS(RADIANS(T21))","v":0.77866432406059782},{"$f":"COS(RADIANS(Sight3!DEC3_))*SIN(RADIANS(T21))","v":0.60835924426211385},null,0,-1.1499999999999999,"S",38,{"$f":"COS(RADIANS(Sight3!HC3_))*COS(RADIANS(AA21))","v":0.51831593709995882},{"$f":"COS(RADIANS(Sight3!HC3_))*SIN(RADIANS(AA21))","v":0.40495279164555764},null,{"$f":"IF(AO21=0,RADIANS(90-Sight3!HO3_),IF(AO21=180,-RADIANS(90-Sight3!HO3_),IF(AO21<180,-RADIANS(90-Sight3!HO3_),RADIANS(90-Sight3!HO3_))))","v":0.71658701551900095},1.8998299667491021,1.8998299667491021,0.99859122090737096,1.5177094170454761,1.5177094170454761,1.407810216078633,-0.69122320055963204,-1.1984737571726494,-1.1984737571726494,340.91277354760234,46.813940938207004,46.813940938207004,71.494513420453458,71.494513420453458,71.494513420453458,46.8136793892442]
[40,0.76604444311897801,0.64278760968653925,null,50,{"$f":"COS(RADIANS(E22))*COS(RADIANS(Sight3!LHA3_))","v":0.61132846838418997},0.76604444311897801,{"$f":"F22*COS(RADIANS(90-Sight3!LAT3_))-G22*SIN(RADIANS(90-Sight3!LAT3_))","v":-7.5343715684177581E-2},{"$f":"F22*SIN(RADIANS(90-Sight3!LAT3_))+G22*COS(RADIANS(90-Sight3!LAT3_))","v":0.97717445197739727},null,{"$f":"COS(RADIANS(E22))*COS(RADIANS(Sight3!AZ_nord3-180))","v":0.56932739353833506},null,null,-1.3,0,null,{"$f":"-1.1*COS(RADIANS(90-Sight3!LON3_))","v":-1.0413348078889946},{"$f":"-1.1*SIN(RADIANS(90-Sight3!LON3_))","v":-0.35443168295003025},null,40,{"$f":"COS(RADIANS(Sight3!DEC3_))*COS(RADIANS(T22))","v":0.75695855135412449},{"$f":"COS(RADIANS(Sight3!DEC3_))*SIN(RADIANS(T22))","v":0.63516364125773395},null,null,null,null,40,{"$f":"COS(RADIANS(Sight3!HC3_))*COS(RADIANS(AA22))","v":0.50386754441880277},{"$f":"COS(RADIANS(Sight3!HC3_))*SIN(RADIANS(AA22))","v":0.42279507068401911},null,{"$f":"IF(AO22=0,RADIANS(90-Sight3!HO3_),IF(AO22=180,-RADIANS(90-Sight3!HO3_),IF(AO22<180,-RADIANS(90-Sight3!HO3_),RADIANS(90-Sight3!HO3_))))","v":0.71658701551900095},1.896385514926908,1.896385514926908,0.9986227639861911,1.5183072372656865,1.5183072372656865,1.4080024145796861,-0.69141539906068517,-1.2020302336349418,-1.2020302336349418,341.11277354760233,46.875687139706073,46.875687139706073,71.324994904752131,71.324994904752131,71.324994904752131,46.875817671179455]
[42,0.74314482547739424,0.66913060635885824,null,48,{"$f":"COS(RADIANS(E23))*COS(RADIANS(Sight3!LHA3_))","v":0.63638219307591493},0.74314482547739424,{"$f":"F23*COS(RADIANS(90-Sight3!LAT3_))-G23*SIN(RADIANS(90-Sight3!LAT3_))","v":-4.1403079713918489E-2},{"$f":"F23*SIN(RADIANS(90-Sight3!LAT3_))+G23*COS(RADIANS(90-Sight3!LAT3_))","v":0.97751333100277493},null,{"$f":"COS(RADIANS(E23))*COS(RADIANS(Sight3!AZ_nord3-180))","v":0.59265981222131836},null,null,null,null,null,null,null,null,42,{"$f":"COS(RADIANS(Sight3!DEC3_))*COS(RADIANS(T23))","v":0.73433054125335229},{"$f":"COS(RADIANS(Sight3!DEC3_))*SIN(RADIANS(T23))","v":0.6611941891959402},null,"Azimut North 3",null,null,42,{"$f":"COS(RADIANS(Sight3!HC3_))*COS(RADIANS(AA23))","v":0.48880526674961766},{"$f":"COS(RADIANS(Sight3!HC3_))*SIN(RADIANS(AA23))","v":0.44012223905544023},null,{"$f":"IF(AO23=0,RADIANS(90-Sight3!HO3_),IF(AO23=180,-RADIANS(90-Sight3!HO3_),IF(AO23<180,-RADIANS(90-Sight3!HO3_),RADIANS(90-Sight3!HO3_))))","v":0.71658701551900095},1.8929409550452863,1.8929409550452863,0.99865387813427153,1.518903668710502,1.518903668710502,1.4081922201112806,-0.6916052045922797,-1.205596242742917,-1.205596242742917,{"$f":"IF(ZB3N>=360,ZB3N-360,ZB3N)","v":341.31277354760232},46.936876603528276,46.936876603528276,{"$f":"IF(OR(LatB3=90,LatB3=-90),LonLP3,IF(OR(AO23=0,AO23=180),LonB3,LonB3+DEGREES(AJ23)+DEGREES(AN23)))","v":71.154850637716777},71.154850637716777,{"$f":"IF(DRLon3+Sight3!LON3_<0,DRLon3+GHAx3-360,DRLon3+GHAx3)","v":71.154850637716777},46.938185326954226]
[44,0.71933980033865119,0.69465837045899725,null,46,{"$f":"COS(RADIANS(E24))*COS(RADIANS(Sight3!LHA3_))","v":0.66066058409253892},0.71933980033865108,{"$f":"F24*COS(RADIANS(90-Sight3!LAT3_))-G24*SIN(RADIANS(90-Sight3!LAT3_))","v":-7.4120004686835106E-3},{"$f":"F24*SIN(RADIANS(90-Sight3!LAT3_))+G24*COS(RADIANS(90-Sight3!LAT3_))","v":0.97666126060871139},null,{"$f":"COS(RADIANS(E24))*COS(RADIANS(Sight3!AZ_nord3-180))","v":0.61527016621535546},null,null,null,null,null,"Sun line + label",null,null,44,{"$f":"COS(RADIANS(Sight3!DEC3_))*COS(RADIANS(T24))","v":0.71080786250301153},{"$f":"COS(RADIANS(Sight3!DEC3_))*SIN(RADIANS(T24))","v":0.68641917386376827},null,{"$f":"Sight3!AZ_nord3","v":152.33978530454002},null,null,44,{"$f":"COS(RADIANS(Sight3!HC3_))*COS(RADIANS(AA24))","v":0.47314745515757745},{"$f":"COS(RADIANS(Sight3!HC3_))*SIN(RADIANS(AA24))","v":0.45691318627420591},null,{"$f":"IF(AO24=0,RADIANS(90-Sight3!HO3_),IF(AO24=180,-RADIANS(90-Sight3!HO3_),IF(AO24<180,-RADIANS(90-Sight3!HO3_),RADIANS(90-Sight3!HO3_))))","v":0.71658701551900095},1.8894962885777802,1.8894962885777802,0.99868456679094297,1.5194987302751521,1.5194987302751521,1.4083796453821273,-0.6917926298631264,-1.2091717481203852,-1.2091717481203852,{"$f":"IF(AO23+dZB3_<0,360+(AO23+dZB3_),IF(AO23+dZB3_>=360,AO23+dZB3_-360,AO23+dZB3_))","v":341.51277354760231},46.997506742952076,46.997506742952076,{"$f":"IF(OR(LatB3=90,LatB3=-90),AR23+dZB3_,IF(OR(AO24=0,AO24=180),LonB3,LonB3+DEGREES(AJ24)+DEGREES(AN24)))","v":70.984083786166408},70.984083786166408,{"$f":"IF(AS24-GHAx3>180,cLOP3+(AS24-GHAx3-360),IF(AS24-GHAx3<-180,cLOP3+(AS24-GHAx3+360),cLOP3+(AS24-GHAx3)))","v":70.984083786166408},47.000781195747265]
[46,0.69465837045899725,0.71933980033865108,null,44,{"$f":"COS(RADIANS(E25))*COS(RADIANS(Sight3!LHA3_))","v":0.68413406195440785},0.69465837045899725,{"$f":"F25*COS(RADIANS(90-Sight3!LAT3_))-G25*SIN(RADIANS(90-Sight3!LAT3_))","v":2.6588109157391404E-2},{"$f":"F25*SIN(RADIANS(90-Sight3!LAT3_))+G25*COS(RADIANS(90-Sight3!LAT3_))","v":0.9746192789117305},null,{"$f":"COS(RADIANS(E25))*COS(RADIANS(Sight3!AZ_nord3-180))","v":0.63713090828696295},null,null,null,null,null,0,0,null,46,{"$f":"COS(RADIANS(Sight3!DEC3_))*COS(RADIANS(T25))","v":0.68641917386376827},{"$f":"COS(RADIANS(Sight3!DEC3_))*SIN(RADIANS(T25))","v":0.71080786250301142},null,null,null,null,46,{"$f":"COS(RADIANS(Sight3!HC3_))*COS(RADIANS(AA25))","v":0.45691318627420591},{"$f":"COS(RADIANS(Sight3!HC3_))*SIN(RADIANS(AA25))","v":0.47314745515757733},null,{"$f":"IF(AO25=0,RADIANS(90-Sight3!HO3_),IF(AO25=180,-RADIANS(90-Sight3!HO3_),IF(AO25<180,-RADIANS(90-Sight3!HO3_),RADIANS(90-Sight3!HO3_))))","v":0.71658701551900095},1.8860515169861711,1.8860515169861711,0.99871483333765199,1.520092440705459,1.520092440705459,1.4085647029087245,-0.69197768738972354,-1.2127567118274483,-1.2127567118274483,341.7127735476023,47.057574980823297,47.057574980823297,70.812697597953587,70.812697597953587,70.812697597953587,47.063604087033909]
[48,0.66913060635885824,0.74314482547739424,null,42,{"$f":"COS(RADIANS(E26))*COS(RADIANS(Sight3!LHA3_))","v":0.70677402784455878},0.66913060635885824,{"$f":"F26*COS(RADIANS(90-Sight3!LAT3_))-G26*SIN(RADIANS(90-Sight3!LAT3_))","v":6.0555825268042207E-2},{"$f":"F26*SIN(RADIANS(90-Sight3!LAT3_))+G26*COS(RADIANS(90-Sight3!LAT3_))","v":0.97138987375198682},null,{"$f":"COS(RADIANS(E26))*COS(RADIANS(Sight3!AZ_nord3-180))","v":0.65821540448931548},null,null,null,null,null,{"$f":"COS(RADIANS(270-Sight3!LON3_+UTday3*360))","v":-0.44911108948925554},{"$f":"SIN(RADIANS(270-Sight3!LON3_+UTday3*360))","v":-0.89347592541588605},null,48,{"$f":"COS(RADIANS(Sight3!DEC3_))*COS(RADIANS(T26))","v":0.6611941891959402},{"$f":"COS(RADIANS(Sight3!DEC3_))*SIN(RADIANS(T26))","v":0.73433054125335229},null,null,null,null,48,{"$f":"COS(RADIANS(Sight3!HC3_))*COS(RADIANS(AA26))","v":0.44012223905544023},{"$f":"COS(RADIANS(Sight3!HC3_))*SIN(RADIANS(AA26))","v":0.48880526674961766},null,{"$f":"IF(AO26=0,RADIANS(90-Sight3!HO3_),IF(AO26=180,-RADIANS(90-Sight3!HO3_),IF(AO26<180,-RADIANS(90-Sight3!HO3_),RADIANS(90-Sight3!HO3_))))","v":0.71658701551900095},1.8826066417206748,1.8826066417206748,0.99874468109877634,1.5206848186003081,1.5206848186003081,1.4087474050174509,-0.69216038949844993,-1.216351094356376,-1.216351094356376,341.91277354760228,47.117078749955553,47.117078749955553,70.640695402342189,70.640695402342189,70.640695402342189,47.126652780447522]
[50,0.64278760968653936,0.76604444311897801,null,40,{"$f":"COS(RADIANS(E27))*COS(RADIANS(Sight3!LHA3_))","v":0.72855289845197424},0.64278760968653925,{"$f":"F27*COS(RADIANS(90-Sight3!LAT3_))-G27*SIN(RADIANS(90-Sight3!LAT3_))","v":9.4449763433513856E-2},{"$f":"F27*SIN(RADIANS(90-Sight3!LAT3_))+G27*COS(RADIANS(90-Sight3!LAT3_))","v":0.96697697966221541},null,{"$f":"COS(RADIANS(E27))*COS(RADIANS(Sight3!AZ_nord3-180))","v":0.67849796661160833},null,null,null,null,null,{"$f":"1.1*COS(RADIANS(270-Sight3!LON3_+UTday3*360))","v":-0.49402219843818113},{"$f":"1.1*SIN(RADIANS(270-Sight3!LON3_+UTday3*360))","v":-0.98282351795747469},null,50,{"$f":"COS(RADIANS(Sight3!DEC3_))*COS(RADIANS(T27))","v":0.63516364125773406},{"$f":"COS(RADIANS(Sight3!DEC3_))*SIN(RADIANS(T27))","v":0.75695855135412449},null,null,null,null,50,{"$f":"COS(RADIANS(Sight3!HC3_))*COS(RADIANS(AA27))","v":0.42279507068401917},{"$f":"COS(RADIANS(Sight3!HC3_))*SIN(RADIANS(AA27))","v":0.50386754441880277},null,{"$f":"IF(AO27=0,RADIANS(90-Sight3!HO3_),IF(AO27=180,-RADIANS(90-Sight3!HO3_),IF(AO27<180,-RADIANS(90-Sight3!HO3_),RADIANS(90-Sight3!HO3_))))","v":0.71658701551900095},1.8791616642201379,1.8791616642201379,0.99877411334242561,1.5212758824141273,1.5212758824141273,1.4089277638466393,-0.69234074832763837,-1.2199548546277903,-1.2199548546277903,342.11277354760227,47.176015493532539,47.176015493532539,70.468080610367949,70.468080610367949,70.468080610367949,47.189926025647409]
[52,0.61566147532565829,0.78801075360672201,null,38,{"$f":"COS(RADIANS(E28))*COS(RADIANS(Sight3!LHA3_))","v":0.7494441395775967},0.61566147532565829,{"$f":"F28*COS(RADIANS(90-Sight3!LAT3_))-G28*SIN(RADIANS(90-Sight3!LAT3_))","v":0.12822862911111227},{"$f":"F28*SIN(RADIANS(90-Sight3!LAT3_))+G28*COS(RADIANS(90-Sight3!LAT3_))","v":0.961385973074111},null,{"$f":"COS(RADIANS(E28))*COS(RADIANS(Sight3!AZ_nord3-180))","v":0.6979538834761847},null,null,null,null,null,null,null,null,52,{"$f":"COS(RADIANS(Sight3!DEC3_))*COS(RADIANS(T28))","v":0.60835924426211385},{"$f":"COS(RADIANS(Sight3!DEC3_))*SIN(RADIANS(T28))","v":0.77866432406059793},null,null,null,null,52,{"$f":"COS(RADIANS(Sight3!HC3_))*COS(RADIANS(AA28))","v":0.40495279164555764},{"$f":"COS(RADIANS(Sight3!HC3_))*SIN(RADIANS(AA28))","v":0.51831593709995882},null,{"$f":"IF(AO28=0,RADIANS(90-Sight3!HO3_),IF(AO28=180,-RADIANS(90-Sight3!HO3_),IF(AO28<180,-RADIANS(90-Sight3!HO3_),RADIANS(90-Sight3!HO3_))))","v":0.71658701551900095},1.87571658591223,1.87571658591223,0.99880313328122494,1.5218656504593273,1.5218656504593273,1.4091057913486043,-0.69251877582960331,-1.2235679499871883,-1.2235679499871883,342.31277354760226,47.23438266551382,47.23438266551382,70.294856715177772,70.294856715177772,70.294856715177772,47.253422542194386]
[54,0.58778525229247314,0.80901699437494745,null,36,{"$f":"COS(RADIANS(E29))*COS(RADIANS(Sight3!LHA3_))","v":0.76942229846216392},0.58778525229247314,{"$f":"F29*COS(RADIANS(90-Sight3!LAT3_))-G29*SIN(RADIANS(90-Sight3!LAT3_))","v":0.16185126795624522},{"$f":"F29*SIN(RADIANS(90-Sight3!LAT3_))+G29*COS(RADIANS(90-Sight3!LAT3_))","v":0.95462366576797231},null,{"$f":"COS(RADIANS(E29))*COS(RADIANS(Sight3!AZ_nord3-180))","v":0.71655945104529928},null,null,null,null,null,"GHAy line + label",null,null,54,{"$f":"COS(RADIANS(Sight3!DEC3_))*COS(RADIANS(T29))","v":0.58081365523791806},{"$f":"COS(RADIANS(Sight3!DEC3_))*SIN(RADIANS(T29))","v":0.79942141423224777},null,null,null,null,54,{"$f":"COS(RADIANS(Sight3!HC3_))*COS(RADIANS(AA29))","v":0.3866171400086717},{"$f":"COS(RADIANS(Sight3!HC3_))*SIN(RADIANS(AA29))","v":0.5321328416522082},null,{"$f":"IF(AO29=0,RADIANS(90-Sight3!HO3_),IF(AO29=180,-RADIANS(90-Sight3!HO3_),IF(AO29<180,-RADIANS(90-Sight3!HO3_),RADIANS(90-Sight3!HO3_))))","v":0.71658701551900095},1.8722714082136349,1.8722714082136349,0.99883174407308273,1.5224541409087102,1.5224541409087102,1.409281499291632,-0.6926944837726311,-1.2271903362017864,-1.2271903362017864,342.51277354760225,47.292177731043282,47.292177731043282,70.121027292348344,70.121027292348344,70.121027292348344,47.317141019434061]
[56,0.55919290347074679,0.82903757255504174,null,34,{"$f":"COS(RADIANS(E30))*COS(RADIANS(Sight3!LHA3_))","v":0.78846303479647417},0.5591929034707469,{"$f":"F30*COS(RADIANS(90-Sight3!LAT3_))-G30*SIN(RADIANS(90-Sight3!LAT3_))","v":0.19527671596264978},{"$f":"F30*SIN(RADIANS(90-Sight3!LAT3_))+G30*COS(RADIANS(90-Sight3!LAT3_))","v":0.94669829657359827},null,{"$f":"COS(RADIANS(E30))*COS(RADIANS(Sight3!AZ_nord3-180))","v":0.73429200130083694},null,null,null,null,null,0,0,null,56,{"$f":"COS(RADIANS(Sight3!DEC3_))*COS(RADIANS(T30))","v":0.55256043424229984},{"$f":"COS(RADIANS(Sight3!DEC3_))*SIN(RADIANS(T30))","v":0.81920453255208447},null,null,null,null,56,{"$f":"COS(RADIANS(Sight3!HC3_))*COS(RADIANS(AA30))","v":0.36781045494049019},{"$f":"COS(RADIANS(Sight3!HC3_))*SIN(RADIANS(AA30))","v":0.54530142430568485},null,{"$f":"IF(AO30=0,RADIANS(90-Sight3!HO3_),IF(AO30=180,-RADIANS(90-Sight3!HO3_),IF(AO30<180,-RADIANS(90-Sight3!HO3_),RADIANS(90-Sight3!HO3_))))","v":0.71658701551900095},1.8688261325302367,1.8688261325302367,0.99885994882194096,1.5230413717978168,1.5230413717978168,1.4094548992619313,-0.6928678837429304,-1.2308219674577041,-1.2308219674577041,342.71277354760224,47.349398166860311,47.349398166860311,69.946596000182012,69.946596000182012,69.946596000182012,47.381080116388276]
[58,0.5299192642332049,0.84804809615642596,null,32,{"$f":"COS(RADIANS(E31))*COS(RADIANS(Sight3!LHA3_))","v":0.80654315037630486},0.5299192642332049,{"$f":"F31*COS(RADIANS(90-Sight3!LAT3_))-G31*SIN(RADIANS(90-Sight3!LAT3_))","v":0.22846424937072624},{"$f":"F31*SIN(RADIANS(90-Sight3!LAT3_))+G31*COS(RADIANS(90-Sight3!LAT3_))","v":0.93761952133254267},null,{"$f":"COS(RADIANS(E31))*COS(RADIANS(Sight3!AZ_nord3-180))","v":0.75112992986180149},null,null,null,null,null,{"$f":"COS(RADIANS(90-Sight3!LON3_+GHAy3))","v":0.98614025628590485},{"$f":"SIN(RADIANS(90-Sight3!LON3_+GHAy3))","v":0.16591381778613234},null,58,{"$f":"COS(RADIANS(Sight3!DEC3_))*COS(RADIANS(T31))","v":0.5236340034729674},{"$f":"COS(RADIANS(Sight3!DEC3_))*SIN(RADIANS(T31))","v":0.83798957633779103},null,null,null,null,58,{"$f":"COS(RADIANS(Sight3!HC3_))*COS(RADIANS(AA31))","v":0.34855564948982104},{"$f":"COS(RADIANS(Sight3!HC3_))*SIN(RADIANS(AA31))","v":0.55780564117089015},null,{"$f":"IF(AO31=0,RADIANS(90-Sight3!HO3_),IF(AO31=180,-RADIANS(90-Sight3!HO3_),IF(AO31<180,-RADIANS(90-Sight3!HO3_),RADIANS(90-Sight3!HO3_))))","v":0.71658701551900095},1.8653807602573051,1.8653807602573051,0.99888775057851253,1.523627361027297,1.523627361027297,1.4096260026655596,-0.69303898714655865,-1.2344627963575281,-1.2344627963575281,342.91277354760223,47.406041461713244,47.406041461713244,69.771566579982178,69.771566579982178,69.771566579982178,47.445238461654249]
[60,0.50000000000000011,0.8660254037844386,null,30,{"$f":"COS(RADIANS(E32))*COS(RADIANS(Sight3!LHA3_))","v":0.82364061736585037},0.49999999999999994,{"$f":"F32*COS(RADIANS(90-Sight3!LAT3_))-G32*SIN(RADIANS(90-Sight3!LAT3_))","v":0.26137343428316429},{"$f":"F32*SIN(RADIANS(90-Sight3!LAT3_))+G32*COS(RADIANS(90-Sight3!LAT3_))","v":0.92739840113395888},null,{"$f":"COS(RADIANS(E32))*COS(RADIANS(Sight3!AZ_nord3-180))","v":0.76705272230592547},null,null,null,null,null,{"$f":"1.15*COS(RADIANS(90-Sight3!LON3_+GHAy3))","v":1.1340612947287905},{"$f":"1.15*SIN(RADIANS(90-Sight3!LON3_+GHAy3))","v":0.19080089045405219},null,60,{"$f":"COS(RADIANS(Sight3!DEC3_))*COS(RADIANS(T32))","v":0.49406960533003813},{"$f":"COS(RADIANS(Sight3!DEC3_))*SIN(RADIANS(T32))","v":0.85575365890712873},null,null,null,null,60,{"$f":"COS(RADIANS(Sight3!HC3_))*COS(RADIANS(AA32))","v":0.32887618267113045},{"$f":"COS(RADIANS(Sight3!HC3_))*SIN(RADIANS(AA32))","v":0.56963025778570098},null,{"$f":"IF(AO32=0,RADIANS(90-Sight3!HO3_),IF(AO32=180,-RADIANS(90-Sight3!HO3_),IF(AO32<180,-RADIANS(90-Sight3!HO3_),RADIANS(90-Sight3!HO3_))))","v":0.71658701551900095},1.8619352927796786,1.8619352927796786,0.99891515234100092,1.5242121263651964,1.5242121263651964,1.4097948207302933,-0.69320780521129233,-1.2381127739181967,-1.2381127739181967,343.11277354760222,47.462105116775859,47.462105116775859,69.595942856305555,69.595942856305555,69.595942856305555,47.50961465331207]
[62,0.46947156278589086,0.88294759285892688,null,28,{"$f":"COS(RADIANS(E33))*COS(RADIANS(Sight3!LHA3_))","v":0.83973460513524656},0.46947156278589081,{"$f":"F33*COS(RADIANS(90-Sight3!LAT3_))-G33*SIN(RADIANS(90-Sight3!LAT3_))","v":0.29396417592741925},{"$f":"F33*SIN(RADIANS(90-Sight3!LAT3_))+G33*COS(RADIANS(90-Sight3!LAT3_))","v":0.91604738883836601},null,{"$f":"COS(RADIANS(E33))*COS(RADIANS(Sight3!AZ_nord3-180))","v":0.7820409791633337},null,null,null,null,null,null,null,null,62,{"$f":"COS(RADIANS(Sight3!DEC3_))*COS(RADIANS(T33))","v":0.4639032594786025},{"$f":"COS(RADIANS(Sight3!DEC3_))*SIN(RADIANS(T33))","v":0.87247513746183425},null,null,null,null,62,{"$f":"COS(RADIANS(Sight3!HC3_))*COS(RADIANS(AA33))","v":0.30879603088334739},{"$f":"COS(RADIANS(Sight3!HC3_))*SIN(RADIANS(AA33))","v":0.5807608676762146},null,{"$f":"IF(AO33=0,RADIANS(90-Sight3!HO3_),IF(AO33=180,-RADIANS(90-Sight3!HO3_),IF(AO33<180,-RADIANS(90-Sight3!HO3_),RADIANS(90-Sight3!HO3_))))","v":0.71658701551900095},1.8584897314719424,1.8584897314719424,0.99894215705580569,1.5247956854492331,1.5247956854492331,1.4099613645074796,-0.69337434898847861,-1.2417718495692931,-1.2417718495692931,343.31277354760221,47.517586646065851,47.517586646065851,69.419728737190468,69.419728737190468,69.419728737190468,47.574207258841]
[64,0.43837114678907746,0.89879404629916704,null,26,{"$f":"COS(RADIANS(E34))*COS(RADIANS(Sight3!LHA3_))","v":0.85480550563948543},0.4383711467890774,{"$f":"F34*COS(RADIANS(90-Sight3!LAT3_))-G34*SIN(RADIANS(90-Sight3!LAT3_))","v":0.32619676750501675},{"$f":"F34*SIN(RADIANS(90-Sight3!LAT3_))+G34*COS(RADIANS(90-Sight3!LAT3_))","v":0.90358031390575633},null,{"$f":"COS(RADIANS(E34))*COS(RADIANS(Sight3!AZ_nord3-180))","v":0.7960764395518094},null,null,null,null,null,"Horizontal axis",null,null,64,{"$f":"COS(RADIANS(Sight3!DEC3_))*COS(RADIANS(T34))","v":0.43317171896431134},{"$f":"COS(RADIANS(Sight3!DEC3_))*SIN(RADIANS(T34))","v":0.88813363945603474},null,null,null,null,64,{"$f":"COS(RADIANS(Sight3!HC3_))*COS(RADIANS(AA34))","v":0.28833965869831513},{"$f":"COS(RADIANS(Sight3!HC3_))*SIN(RADIANS(AA34))","v":0.59118390990881853},null,{"$f":"IF(AO34=0,RADIANS(90-Sight3!HO3_),IF(AO34=180,-RADIANS(90-Sight3!HO3_),IF(AO34<180,-RADIANS(90-Sight3!HO3_),RADIANS(90-Sight3!HO3_))))","v":0.71658701551900095},1.8550440776986086,1.8550440776986086,0.99896876761821374,1.5253780557890526,1.5253780557890526,1.4101256448738455,-0.69353862935484456,-1.2454399711516924,-1.2454399711516924,343.51277354760219,47.57248357686548,47.57248357686548,69.242928214363431,69.242928214363431,69.242928214363431,47.63901481504378]
[66,0.40673664307580021,0.91354545764260087,null,24,{"$f":"COS(RADIANS(E35))*COS(RADIANS(Sight3!LHA3_))","v":0.86883495730779658},0.40673664307580021,{"$f":"F35*COS(RADIANS(90-Sight3!LAT3_))-G35*SIN(RADIANS(90-Sight3!LAT3_))","v":0.35803193856816945},{"$f":"F35*SIN(RADIANS(90-Sight3!LAT3_))+G35*COS(RADIANS(90-Sight3!LAT3_))","v":0.89001236554652996},null,{"$f":"COS(RADIANS(E35))*COS(RADIANS(Sight3!AZ_nord3-180))","v":0.80914200342486631},null,null,null,null,null,-1.3,0,null,{"$f":"SUM(T34+2)","v":66},{"$f":"COS(RADIANS(Sight3!DEC3_))*COS(RADIANS(T35))","v":0.4019124254354503},{"$f":"COS(RADIANS(Sight3!DEC3_))*SIN(RADIANS(T35))","v":0.90271008741705761},null,null,null,null,66,{"$f":"COS(RADIANS(Sight3!HC3_))*COS(RADIANS(AA35))","v":0.26753198905447845},{"$f":"COS(RADIANS(Sight3!HC3_))*SIN(RADIANS(AA35))","v":0.60088668561209879},null,{"$f":"IF(AO35=0,RADIANS(90-Sight3!HO3_),IF(AO35=180,-RADIANS(90-Sight3!HO3_),IF(AO35<180,-RADIANS(90-Sight3!HO3_),RADIANS(90-Sight3!HO3_))))","v":0.71658701551900095},1.8515983328142891,1.8515983328142891,0.99899498687307531,1.5259592547684353,1.5259592547684353,1.4102876725332723,-0.6937006570142713,-1.2491170849166175,-1.2491170849166175,343.71277354760218,47.626793450144675,47.626793450144675,69.065545363419687,69.065545363419687,69.065545363419687,47.704035827980455]
[68,0.37460659341591196,0.92718385456678742,null,22,{"$f":"COS(RADIANS(E36))*COS(RADIANS(Sight3!LHA3_))","v":0.88180586741439382},0.37460659341591201,{"$f":"F36*COS(RADIANS(90-Sight3!LAT3_))-G36*SIN(RADIANS(90-Sight3!LAT3_))","v":0.38943090286476928},{"$f":"F36*SIN(RADIANS(90-Sight3!LAT3_))+G36*COS(RADIANS(90-Sight3!LAT3_))","v":0.87536007421578033},null,{"$f":"COS(RADIANS(E36))*COS(RADIANS(Sight3!AZ_nord3-180))","v":0.82122175240552087},null,null,null,null,null,1.3,0,null,68,{"$f":"COS(RADIANS(Sight3!DEC3_))*COS(RADIANS(T36))","v":0.37016346352605928},{"$f":"COS(RADIANS(Sight3!DEC3_))*SIN(RADIANS(T36))","v":0.91618672218839203},null,null,null,null,68,{"$f":"COS(RADIANS(Sight3!HC3_))*COS(RADIANS(AA36))","v":0.24639837289212266},{"$f":"COS(RADIANS(Sight3!HC3_))*SIN(RADIANS(AA36))","v":0.60985737344845914},null,{"$f":"IF(AO36=0,RADIANS(90-Sight3!HO3_),IF(AO36=180,-RADIANS(90-Sight3!HO3_),IF(AO36<180,-RADIANS(90-Sight3!HO3_),RADIANS(90-Sight3!HO3_))))","v":0.71658701551900095},1.8481524981638691,1.8481524981638691,0.99902081761546668,1.526539299647494,1.526539299647494,1.4104474580185431,-0.69386044249954215,-1.2528031355250755,-1.2528031355250755,343.91277354760217,47.680513820985489,47.680513820985489,68.887584343981644,68.887584343981644,68.887584343981644,47.769268772910252]
[70,0.34202014332566882,0.93969262078590832,null,20,{"$f":"COS(RADIANS(E37))*COS(RADIANS(Sight3!LHA3_))","v":0.89370243290332763},0.34202014332566871,{"$f":"F37*COS(RADIANS(90-Sight3!LAT3_))-G37*SIN(RADIANS(90-Sight3!LAT3_))","v":0.42035540559346019},{"$f":"F37*SIN(RADIANS(90-Sight3!LAT3_))+G37*COS(RADIANS(90-Sight3!LAT3_))","v":0.85964129147348145},null,{"$f":"COS(RADIANS(E37))*COS(RADIANS(Sight3!AZ_nord3-180))","v":0.83230096918038288},null,null,null,null,null,null,null,null,70,{"$f":"COS(RADIANS(Sight3!DEC3_))*COS(RADIANS(T37))","v":0.33796351445567246},{"$f":"COS(RADIANS(Sight3!DEC3_))*SIN(RADIANS(T37))","v":0.92854712456648558},null,null,null,null,70,{"$f":"COS(RADIANS(Sight3!HC3_))*COS(RADIANS(AA37))","v":0.22496455826715772},{"$f":"COS(RADIANS(Sight3!HC3_))*SIN(RADIANS(AA37))","v":0.61808504401659925},null,{"$f":"IF(AO37=0,RADIANS(90-Sight3!HO3_),IF(AO37=180,-RADIANS(90-Sight3!HO3_),IF(AO37<180,-RADIANS(90-Sight3!HO3_),RADIANS(90-Sight3!HO3_))))","v":0.71658701551900095},1.8447065750826781,1.8447065750826781,0.99904626259133833,1.5271182075648289,1.5271182075648289,1.4106050116930473,-0.69401799617404636,-1.2564980660477174,-1.2564980660477174,344.11277354760216,47.733642259009144,47.733642259009144,68.709049399830207,68.709049399830207,{"$f":"IF(AS37-GHAx3>180,cLOP3+(AS37-GHAx3-360),cLOP3+(AS37-GHAx3))","v":68.709049399830207},47.8347120942435]
[72,0.30901699437494745,0.95105651629515353,null,18,{"$f":"COS(RADIANS(E38))*COS(RADIANS(Sight3!LHA3_))","v":0.90451015964207515},0.3090169943749474,{"$f":"F38*COS(RADIANS(90-Sight3!LAT3_))-G38*SIN(RADIANS(90-Sight3!LAT3_))","v":0.45076777001122204},{"$f":"F38*SIN(RADIANS(90-Sight3!LAT3_))+G38*COS(RADIANS(90-Sight3!LAT3_))","v":0.8428751682351121},null,{"$f":"COS(RADIANS(E38))*COS(RADIANS(Sight3!AZ_nord3-180))","v":0.84236615543043447},null,null,null,null,null,"Hour marks",null,null,72,{"$f":"COS(RADIANS(Sight3!DEC3_))*COS(RADIANS(T38))","v":0.30535180890220975},{"$f":"COS(RADIANS(Sight3!DEC3_))*SIN(RADIANS(T38))","v":0.93977623530501475},null,null,null,null,72,{"$f":"COS(RADIANS(Sight3!HC3_))*COS(RADIANS(AA38))","v":0.20325665898107778},{"$f":"COS(RADIANS(Sight3!HC3_))*SIN(RADIANS(AA38))","v":0.62555967316730765},null,{"$f":"IF(AO38=0,RADIANS(90-Sight3!HO3_),IF(AO38=180,-RADIANS(90-Sight3!HO3_),IF(AO38<180,-RADIANS(90-Sight3!HO3_),RADIANS(90-Sight3!HO3_))))","v":0.71658701551900095},1.841260564896658,1.841260564896658,0.99907132449814973,1.5276959955396607,1.5276959955396607,1.410760343752463,-0.69417332823346201,-1.2602018179650998,-1.2602018179650998,344.31277354760215,47.786176348803998,47.786176348803998,68.529944859011977,68.529944859011977,{"$f":"IF(AS38-GHAx3>180,cLOP3+(AS38-GHAx3-360),cLOP3+(AS38-GHAx3))","v":68.529944859011977},47.900364205502285]
[74,0.27563735581699916,0.96126169593831889,null,16,{"$f":"COS(RADIANS(E39))*COS(RADIANS(Sight3!LHA3_))","v":0.91421588008040799},0.27563735581699916,{"$f":"F39*COS(RADIANS(90-Sight3!LAT3_))-G39*SIN(RADIANS(90-Sight3!LAT3_))","v":0.48063094333667716},{"$f":"F39*SIN(RADIANS(90-Sight3!LAT3_))+G39*COS(RADIANS(90-Sight3!LAT3_))","v":0.82508213143921472},null,{"$f":"COS(RADIANS(E39))*COS(RADIANS(Sight3!AZ_nord3-180))","v":0.85140504827665342},null,0,{"$f":"COS(RADIANS(90+M39))","v":6.1257422745431001E-17},{"$f":"SIN(RADIANS(90+M39))","v":1},0,{"$f":"COS(RADIANS(90+P39))","v":6.1257422745431001E-17},{"$f":"SIN(RADIANS(90+P39))","v":1},null,74,{"$f":"COS(RADIANS(Sight3!DEC3_))*COS(RADIANS(T39))","v":0.27236807920544009},{"$f":"COS(RADIANS(Sight3!DEC3_))*SIN(RADIANS(T39))","v":0.94986037346225649},null,null,null,null,74,{"$f":"COS(RADIANS(Sight3!HC3_))*COS(RADIANS(AA39))","v":0.18130112276531757},{"$f":"COS(RADIANS(Sight3!HC3_))*SIN(RADIANS(AA39))","v":0.63227215421634231}]
[76,0.24192189559966767,0.97029572627599647,null,14,{"$f":"COS(RADIANS(E40))*COS(RADIANS(Sight3!LHA3_))","v":0.92280776929302355},0.24192189559966773,{"$f":"F40*COS(RADIANS(90-Sight3!LAT3_))-G40*SIN(RADIANS(90-Sight3!LAT3_))","v":0.5099085418931979},{"$f":"F40*SIN(RADIANS(90-Sight3!LAT3_))+G40*COS(RADIANS(90-Sight3!LAT3_))","v":0.80628385916031797},null,{"$f":"COS(RADIANS(E40))*COS(RADIANS(Sight3!AZ_nord3-180))","v":0.85940663522044092},null,{"$f":"SUM(M39+5)","v":5},{"$f":"COS(RADIANS(90+M40))","v":-8.7155742747658235E-2},{"$f":"SIN(RADIANS(90+M40))","v":0.99619469809174555},{"$f":"SUM(P39+15)","v":15},{"$f":"COS(RADIANS(90+P40))","v":-0.25881904510252085},{"$f":"SIN(RADIANS(90+P40))","v":0.96592582628906831},null,76,{"$f":"COS(RADIANS(Sight3!DEC3_))*COS(RADIANS(T40))","v":0.23905251095924493},{"$f":"COS(RADIANS(Sight3!DEC3_))*SIN(RADIANS(T40))","v":0.95878725306920831},null,null,null,null,76,{"$f":"COS(RADIANS(Sight3!HC3_))*COS(RADIANS(AA40))","v":0.15912469905876489},{"$f":"COS(RADIANS(Sight3!HC3_))*SIN(RADIANS(AA40))","v":0.63821430903952348}]
[78,0.20791169081775945,0.97814760073380558,null,12,{"$f":"COS(RADIANS(E41))*COS(RADIANS(Sight3!LHA3_))","v":0.93027535938639561},0.20791169081775934,{"$f":"F41*COS(RADIANS(90-Sight3!LAT3_))-G41*SIN(RADIANS(90-Sight3!LAT3_))","v":0.53856489543681141},{"$f":"F41*SIN(RADIANS(90-Sight3!LAT3_))+G41*COS(RADIANS(90-Sight3!LAT3_))","v":0.78650325419754208},null,{"$f":"COS(RADIANS(E41))*COS(RADIANS(Sight3!AZ_nord3-180))","v":0.86636116756065629},null,{"$f":"SUM(M40+5)","v":10},-0.1736481776669303,0.98480775301220802,{"$f":"SUM(P40+15)","v":30},-0.49999999999999978,0.86602540378443871,null,78,{"$f":"COS(RADIANS(Sight3!DEC3_))*COS(RADIANS(T41))","v":0.2054456940516626},{"$f":"COS(RADIANS(Sight3!DEC3_))*SIN(RADIANS(T41))","v":0.96654599809814989},null,null,null,null,78,{"$f":"COS(RADIANS(Sight3!HC3_))*COS(RADIANS(AA41))","v":0.13675440641769007},{"$f":"COS(RADIANS(Sight3!HC3_))*SIN(RADIANS(AA41))","v":0.64337889803651793}]
[80,0.17364817766693041,0.98480775301220802,null,10,{"$f":"COS(RADIANS(E42))*COS(RADIANS(Sight3!LHA3_))","v":0.93660955225228903},0.17364817766693033,{"$f":"F42*COS(RADIANS(90-Sight3!LAT3_))-G42*SIN(RADIANS(90-Sight3!LAT3_))","v":0.56656509061489757},{"$f":"F42*SIN(RADIANS(90-Sight3!LAT3_))+G42*COS(RADIANS(90-Sight3!LAT3_))","v":0.76576441617106505},null,{"$f":"COS(RADIANS(E42))*COS(RADIANS(Sight3!AZ_nord3-180))","v":0.87226017227090624},null,15,-0.25881904510252085,0.96592582628906831,45,-0.70710678118654746,0.70710678118654757,null,80,{"$f":"COS(RADIANS(Sight3!DEC3_))*COS(RADIANS(T42))","v":0.17158857321236126},{"$f":"COS(RADIANS(Sight3!DEC3_))*SIN(RADIANS(T42))","v":0.97312715571340636},null,null,null,null,80,{"$f":"COS(RADIANS(Sight3!HC3_))*COS(RADIANS(AA42))","v":0.11421749959779662},{"$f":"COS(RADIANS(Sight3!HC3_))*SIN(RADIANS(AA42))","v":0.64775962895117678}]
[82,0.13917310096006547,0.99026806874157036,null,8,{"$f":"COS(RADIANS(E43))*COS(RADIANS(Sight3!LHA3_))","v":0.94180263065240477},0.13917310096006544,{"$f":"F43*COS(RADIANS(90-Sight3!LAT3_))-G43*SIN(RADIANS(90-Sight3!LAT3_))","v":0.59387501350273142},{"$f":"F43*SIN(RADIANS(90-Sight3!LAT3_))+G43*COS(RADIANS(90-Sight3!LAT3_))","v":0.74409261216044942},null,{"$f":"COS(RADIANS(E43))*COS(RADIANS(Sight3!AZ_nord3-180))","v":0.87709646232262362},null,20,-0.34202014332566871,0.93969262078590843,60,-0.86602540378443871,0.49999999999999994,null,82,{"$f":"COS(RADIANS(Sight3!DEC3_))*COS(RADIANS(T43))","v":0.13752239812779415},{"$f":"COS(RADIANS(Sight3!DEC3_))*SIN(RADIANS(T43))","v":0.9785227077881733},null,null,null,null,82,{"$f":"COS(RADIANS(Sight3!HC3_))*COS(RADIANS(AA43))","v":9.154143634850033E-2},{"$f":"COS(RADIANS(Sight3!HC3_))*SIN(RADIANS(AA43))","v":0.65135116453768038}]
[84,0.10452846326765346,0.99452189536827329,null,6,{"$f":"COS(RADIANS(E44))*COS(RADIANS(Sight3!LHA3_))","v":0.94584826762064422},0.10452846326765347,{"$f":"F44*COS(RADIANS(90-Sight3!LAT3_))-G44*SIN(RADIANS(90-Sight3!LAT3_))","v":0.62046139116604515},{"$f":"F44*SIN(RADIANS(90-Sight3!LAT3_))+G44*COS(RADIANS(90-Sight3!LAT3_))","v":0.72151424592059632},null,{"$f":"COS(RADIANS(E44))*COS(RADIANS(Sight3!AZ_nord3-180))","v":0.88086414544135361},null,25,-0.42261826174069933,0.90630778703665005,75,-0.9659258262890682,0.25881904510252102,null,84,{"$f":"COS(RADIANS(Sight3!DEC3_))*COS(RADIANS(T44))","v":0.10328867318480985},{"$f":"COS(RADIANS(Sight3!DEC3_))*SIN(RADIANS(T44))","v":0.98272608067336831},null,null,null,null,84,{"$f":"COS(RADIANS(Sight3!HC3_))*COS(RADIANS(AA44))","v":6.8753843959890676E-2},{"$f":"COS(RADIANS(Sight3!HC3_))*SIN(RADIANS(AA44))","v":0.65414912906315015}]
[86,6.9756473744125233E-2,0.9975640502598242,null,4,{"$f":"COS(RADIANS(E45))*COS(RADIANS(Sight3!LHA3_))","v":0.94874153417154461},6.9756473744125302E-2,{"$f":"F45*COS(RADIANS(90-Sight3!LAT3_))-G45*SIN(RADIANS(90-Sight3!LAT3_))","v":0.64629183219897368},{"$f":"F45*SIN(RADIANS(90-Sight3!LAT3_))+G45*COS(RADIANS(90-Sight3!LAT3_))","v":0.69805682571283878},null,{"$f":"COS(RADIANS(E45))*COS(RADIANS(Sight3!AZ_nord3-180))","v":0.88355863128558321},null,30,-0.49999999999999978,0.86602540378443871,90,-1,1.22514845490862E-16,null,86,{"$f":"COS(RADIANS(Sight3!DEC3_))*COS(RADIANS(T45))","v":6.8929106903950224E-2},{"$f":"COS(RADIANS(Sight3!DEC3_))*SIN(RADIANS(T45))","v":0.98573215320661112},null,null,null,null,86,{"$f":"COS(RADIANS(Sight3!HC3_))*COS(RADIANS(AA45))","v":4.5882485603133683E-2},{"$f":"COS(RADIANS(Sight3!HC3_))*SIN(RADIANS(AA45))","v":0.65615011363880527}]
[88,3.489949670250108E-2,0.99939082701909576,null,2,{"$f":"COS(RADIANS(E46))*COS(RADIANS(Sight3!LHA3_))","v":0.95047890530548718},3.4899496702500969E-2,{"$f":"F46*COS(RADIANS(90-Sight3!LAT3_))-G46*SIN(RADIANS(90-Sight3!LAT3_))","v":0.67133486618799287},{"$f":"F46*SIN(RADIANS(90-Sight3!LAT3_))+G46*COS(RADIANS(90-Sight3!LAT3_))","v":0.67374893079036113},null,{"$f":"COS(RADIANS(E46))*COS(RADIANS(Sight3!AZ_nord3-180))","v":0.885176637039365},null,35,-0.57357643635104616,0.81915204428899169,105,-0.96592582628906831,-0.25881904510252079,null,88,{"$f":"COS(RADIANS(Sight3!DEC3_))*COS(RADIANS(T46))","v":3.4485561124043343E-2},{"$f":"COS(RADIANS(Sight3!DEC3_))*SIN(RADIANS(T46))","v":0.98753726295156985},null,null,null,null,88,{"$f":"COS(RADIANS(Sight3!HC3_))*COS(RADIANS(AA46))","v":2.2955226505324517E-2},{"$f":"COS(RADIANS(Sight3!HC3_))*SIN(RADIANS(AA46))","v":0.65735168037316838}]
[90,6.1257422745431001E-17,1,null,0,{"$f":"COS(RADIANS(E47))*COS(RADIANS(Sight3!LHA3_))","v":0.95105826430336649},0,{"$f":"F47*COS(RADIANS(90-Sight3!LAT3_))-G47*SIN(RADIANS(90-Sight3!LAT3_))","v":0.69555998205377045},{"$f":"F47*SIN(RADIANS(90-Sight3!LAT3_))+G47*COS(RADIANS(90-Sight3!LAT3_))","v":0.64862017657878213},null,{"$f":"COS(RADIANS(E47))*COS(RADIANS(Sight3!AZ_nord3-180))","v":0.88571619141192259},null,40,-0.64278760968653936,0.76604444311897801,120,-0.8660254037844386,-0.50000000000000011,null,90,{"$f":"COS(RADIANS(Sight3!DEC3_))*COS(RADIANS(T47))","v":6.0530861358740778E-17},{"$f":"COS(RADIANS(Sight3!DEC3_))*SIN(RADIANS(T47))","v":0.98813921066007604},null,null,null,null,90,{"$f":"COS(RADIANS(Sight3!HC3_))*COS(RADIANS(AA47))","v":4.0292214705578047E-17},{"$f":"COS(RADIANS(Sight3!HC3_))*SIN(RADIANS(AA47))","v":0.65775236534226078}]
[92,-3.4899496702500955E-2,0.99939082701909576,null,-2,{"$f":"COS(RADIANS(E48))*COS(RADIANS(Sight3!LHA3_))","v":0.95047890530548718},-3.4899496702500969E-2,{"$f":"F48*COS(RADIANS(90-Sight3!LAT3_))-G48*SIN(RADIANS(90-Sight3!LAT3_))","v":0.71893766522421731},{"$f":"F48*SIN(RADIANS(90-Sight3!LAT3_))+G48*COS(RADIANS(90-Sight3!LAT3_))","v":0.62270117859432095},null,{"$f":"COS(RADIANS(E48))*COS(RADIANS(Sight3!AZ_nord3-180))","v":0.885176637039365},null,45,-0.70710678118654746,0.70710678118654757,135,-0.70710678118654768,-0.70710678118654746,null,92,{"$f":"COS(RADIANS(Sight3!DEC3_))*COS(RADIANS(T48))","v":-3.4485561124043218E-2},{"$f":"COS(RADIANS(Sight3!DEC3_))*SIN(RADIANS(T48))","v":0.98753726295156985},null,null,null,null,92,{"$f":"COS(RADIANS(Sight3!HC3_))*COS(RADIANS(AA48))","v":-2.2955226505324434E-2},{"$f":"COS(RADIANS(Sight3!HC3_))*SIN(RADIANS(AA48))","v":0.65735168037316838}]
[94,-6.975647374412533E-2,0.9975640502598242,null,-4,{"$f":"COS(RADIANS(E49))*COS(RADIANS(Sight3!LHA3_))","v":0.94874153417154461},-6.9756473744125302E-2,{"$f":"F49*COS(RADIANS(90-Sight3!LAT3_))-G49*SIN(RADIANS(90-Sight3!LAT3_))","v":0.741439433593446},{"$f":"F49*SIN(RADIANS(90-Sight3!LAT3_))+G49*COS(RADIANS(90-Sight3!LAT3_))","v":0.59602351514350582},null,{"$f":"COS(RADIANS(E49))*COS(RADIANS(Sight3!AZ_nord3-180))","v":0.88355863128558321},null,50,-0.7660444431189779,0.64278760968653947,150,-0.50000000000000044,-0.86602540378443837,null,94,{"$f":"COS(RADIANS(Sight3!DEC3_))*COS(RADIANS(T49))","v":-6.8929106903950321E-2},{"$f":"COS(RADIANS(Sight3!DEC3_))*SIN(RADIANS(T49))","v":0.98573215320661112},null,null,null,null,94,{"$f":"COS(RADIANS(Sight3!HC3_))*COS(RADIANS(AA49))","v":-4.5882485603133745E-2},{"$f":"COS(RADIANS(Sight3!HC3_))*SIN(RADIANS(AA49))","v":0.65615011363880527}]
[96,-0.10452846326765355,0.99452189536827329,null,-6,{"$f":"COS(RADIANS(E50))*COS(RADIANS(Sight3!LHA3_))","v":0.94584826762064422},-0.10452846326765347,{"$f":"F50*COS(RADIANS(90-Sight3!LAT3_))-G50*SIN(RADIANS(90-Sight3!LAT3_))","v":0.7630378722228307},{"$f":"F50*SIN(RADIANS(90-Sight3!LAT3_))+G50*COS(RADIANS(90-Sight3!LAT3_))","v":0.56861968884987268},null,{"$f":"COS(RADIANS(E50))*COS(RADIANS(Sight3!AZ_nord3-180))","v":0.88086414544135361},null,55,-0.81915204428899191,0.57357643635104594,165,-0.25881904510252063,-0.96592582628906831,null,96,{"$f":"COS(RADIANS(Sight3!DEC3_))*COS(RADIANS(T50))","v":-0.10328867318480993},{"$f":"COS(RADIANS(Sight3!DEC3_))*SIN(RADIANS(T50))","v":0.98272608067336831},null,null,null,null,96,{"$f":"COS(RADIANS(Sight3!HC3_))*COS(RADIANS(AA50))","v":-6.8753843959890745E-2},{"$f":"COS(RADIANS(Sight3!HC3_))*SIN(RADIANS(AA50))","v":0.65414912906315015}]
[98,-0.13917310096006535,0.99026806874157036,null,-8,{"$f":"COS(RADIANS(E51))*COS(RADIANS(Sight3!LHA3_))","v":0.94180263065240477},-0.13917310096006544,{"$f":"F51*COS(RADIANS(90-Sight3!LAT3_))-G51*SIN(RADIANS(90-Sight3!LAT3_))","v":0.78370666674188583},{"$f":"F51*SIN(RADIANS(90-Sight3!LAT3_))+G51*COS(RADIANS(90-Sight3!LAT3_))","v":0.54052308705452456},null,{"$f":"COS(RADIANS(E51))*COS(RADIANS(Sight3!AZ_nord3-180))","v":0.87709646232262362},null,60,-0.86602540378443871,0.49999999999999994,180,-1.83772268236293E-16,-1,null,98,{"$f":"COS(RADIANS(Sight3!DEC3_))*COS(RADIANS(T51))","v":-0.13752239812779404},{"$f":"COS(RADIANS(Sight3!DEC3_))*SIN(RADIANS(T51))","v":0.9785227077881733},null,null,null,null,98,{"$f":"COS(RADIANS(Sight3!HC3_))*COS(RADIANS(AA51))","v":-9.1541436348500246E-2},{"$f":"COS(RADIANS(Sight3!HC3_))*SIN(RADIANS(AA51))","v":0.65135116453768038}]
[100,-0.1736481776669303,0.98480775301220802,null,-10,{"$f":"COS(RADIANS(E52))*COS(RADIANS(Sight3!LHA3_))","v":0.93660955225228903},-0.17364817766693033,{"$f":"F52*COS(RADIANS(90-Sight3!LAT3_))-G52*SIN(RADIANS(90-Sight3!LAT3_))","v":0.80342063540827335},{"$f":"F52*SIN(RADIANS(90-Sight3!LAT3_))+G52*COS(RADIANS(90-Sight3!LAT3_))","v":0.5117679411387992},null,{"$f":"COS(RADIANS(E52))*COS(RADIANS(Sight3!AZ_nord3-180))","v":0.87226017227090624},null,65,-0.90630778703664994,0.4226182617406995,195,0.2588190451025203,-0.96592582628906842,null,100,{"$f":"COS(RADIANS(Sight3!DEC3_))*COS(RADIANS(T52))","v":-0.17158857321236115},{"$f":"COS(RADIANS(Sight3!DEC3_))*SIN(RADIANS(T52))","v":0.97312715571340636},null,null,null,null,100,{"$f":"COS(RADIANS(Sight3!HC3_))*COS(RADIANS(AA52))","v":-0.11421749959779655},{"$f":"COS(RADIANS(Sight3!HC3_))*SIN(RADIANS(AA52))","v":0.64775962895117678}]
[102,-0.20791169081775934,0.97814760073380569,null,-12,{"$f":"COS(RADIANS(E53))*COS(RADIANS(Sight3!LHA3_))","v":0.93027535938639561},-0.20791169081775934,{"$f":"F53*COS(RADIANS(90-Sight3!LAT3_))-G53*SIN(RADIANS(90-Sight3!LAT3_))","v":0.82215575978787769},{"$f":"F53*SIN(RADIANS(90-Sight3!LAT3_))+G53*COS(RADIANS(90-Sight3!LAT3_))","v":0.48238928481860444},null,{"$f":"COS(RADIANS(E53))*COS(RADIANS(Sight3!AZ_nord3-180))","v":0.86636116756065629},null,70,-0.93969262078590832,0.34202014332566888,210,0.50000000000000011,-0.8660254037844386,null,102,{"$f":"COS(RADIANS(Sight3!DEC3_))*COS(RADIANS(T53))","v":-0.20544569405166249},{"$f":"COS(RADIANS(Sight3!DEC3_))*SIN(RADIANS(T53))","v":0.96654599809815001},null,null,null,null,102,{"$f":"COS(RADIANS(Sight3!HC3_))*COS(RADIANS(AA53))","v":-0.13675440641769002},{"$f":"COS(RADIANS(Sight3!HC3_))*SIN(RADIANS(AA53))","v":0.64337889803651804}]
[104,-0.24192189559966779,0.97029572627599647,null,-14,{"$f":"COS(RADIANS(E54))*COS(RADIANS(Sight3!LHA3_))","v":0.92280776929302355},-0.24192189559966773,{"$f":"F54*COS(RADIANS(90-Sight3!LAT3_))-G54*SIN(RADIANS(90-Sight3!LAT3_))","v":0.83988921401756667},{"$f":"F54*SIN(RADIANS(90-Sight3!LAT3_))+G54*COS(RADIANS(90-Sight3!LAT3_))","v":0.45242291146123093},null,{"$f":"COS(RADIANS(E54))*COS(RADIANS(Sight3!AZ_nord3-180))","v":0.85940663522044092},null,75,-0.9659258262890682,0.25881904510252102,225,0.70710678118654735,-0.70710678118654768,null,104,{"$f":"COS(RADIANS(Sight3!DEC3_))*COS(RADIANS(T54))","v":-0.23905251095924504},{"$f":"COS(RADIANS(Sight3!DEC3_))*SIN(RADIANS(T54))","v":0.95878725306920831},null,null,null,null,104,{"$f":"COS(RADIANS(Sight3!HC3_))*COS(RADIANS(AA54))","v":-0.15912469905876495},{"$f":"COS(RADIANS(Sight3!HC3_))*SIN(RADIANS(AA54))","v":0.63821430903952348}]
[106,-0.27563735581699905,0.96126169593831889,null,-16,{"$f":"COS(RADIANS(E55))*COS(RADIANS(Sight3!LHA3_))","v":0.91421588008040799},-0.27563735581699916,{"$f":"F55*COS(RADIANS(90-Sight3!LAT3_))-G55*SIN(RADIANS(90-Sight3!LAT3_))","v":0.85659939261499085},{"$f":"F55*SIN(RADIANS(90-Sight3!LAT3_))+G55*COS(RADIANS(90-Sight3!LAT3_))","v":0.4219053304766493},null,{"$f":"COS(RADIANS(E55))*COS(RADIANS(Sight3!AZ_nord3-180))","v":0.85140504827665342},null,80,-0.98480775301220802,0.17364817766693028,240,0.86602540378443837,-0.50000000000000044,null,106,{"$f":"COS(RADIANS(Sight3!DEC3_))*COS(RADIANS(T55))","v":-0.27236807920543998},{"$f":"COS(RADIANS(Sight3!DEC3_))*SIN(RADIANS(T55))","v":0.94986037346225649},null,null,null,null,106,{"$f":"COS(RADIANS(Sight3!HC3_))*COS(RADIANS(AA55))","v":-0.18130112276531749},{"$f":"COS(RADIANS(Sight3!HC3_))*SIN(RADIANS(AA55))","v":0.63227215421634231}]
[108,-0.30901699437494734,0.95105651629515364,null,-18,{"$f":"COS(RADIANS(E56))*COS(RADIANS(Sight3!LHA3_))","v":0.90451015964207515},-0.3090169943749474,{"$f":"F56*COS(RADIANS(90-Sight3!LAT3_))-G56*SIN(RADIANS(90-Sight3!LAT3_))","v":0.87226593680153486},{"$f":"F56*SIN(RADIANS(90-Sight3!LAT3_))+G56*COS(RADIANS(90-Sight3!LAT3_))","v":0.39087372283641586},null,{"$f":"COS(RADIANS(E56))*COS(RADIANS(Sight3!AZ_nord3-180))","v":0.84236615543043447},null,85,-0.99619469809174555,8.7155742747658194E-2,255,0.96592582628906831,-0.25881904510252068,null,108,{"$f":"COS(RADIANS(Sight3!DEC3_))*COS(RADIANS(T56))","v":-0.30535180890220964},{"$f":"COS(RADIANS(Sight3!DEC3_))*SIN(RADIANS(T56))","v":0.93977623530501486},null,null,null,null,108,{"$f":"COS(RADIANS(Sight3!HC3_))*COS(RADIANS(AA56))","v":-0.2032566589810777},{"$f":"COS(RADIANS(Sight3!HC3_))*SIN(RADIANS(AA56))","v":0.62555967316730765}]
[110,-0.34202014332566871,0.93969262078590843,null,-20,{"$f":"COS(RADIANS(E57))*COS(RADIANS(Sight3!LHA3_))","v":0.89370243290332763},-0.34202014332566871,{"$f":"F57*COS(RADIANS(90-Sight3!LAT3_))-G57*SIN(RADIANS(90-Sight3!LAT3_))","v":0.8868697593063537},{"$f":"F57*SIN(RADIANS(90-Sight3!LAT3_))+G57*COS(RADIANS(90-Sight3!LAT3_))","v":0.35936589577438743},null,{"$f":"COS(RADIANS(E57))*COS(RADIANS(Sight3!AZ_nord3-180))","v":0.83230096918038288},null,90,-1,1.22514845490862E-16,270,1,-2.45029690981724E-16,null,110,{"$f":"COS(RADIANS(Sight3!DEC3_))*COS(RADIANS(T57))","v":-0.33796351445567235},{"$f":"COS(RADIANS(Sight3!DEC3_))*SIN(RADIANS(T57))","v":0.92854712456648569},null,null,null,null,110,{"$f":"COS(RADIANS(Sight3!HC3_))*COS(RADIANS(AA57))","v":-0.22496455826715764},{"$f":"COS(RADIANS(Sight3!HC3_))*SIN(RADIANS(AA57))","v":0.61808504401659936}]
[112,-0.37460659341591207,0.92718385456678742,null,-22,{"$f":"COS(RADIANS(E58))*COS(RADIANS(Sight3!LHA3_))","v":0.88180586741439382},-0.37460659341591201,{"$f":"F58*COS(RADIANS(90-Sight3!LAT3_))-G58*SIN(RADIANS(90-Sight3!LAT3_))","v":0.90039306762127147},{"$f":"F58*SIN(RADIANS(90-Sight3!LAT3_))+G58*COS(RADIANS(90-Sight3!LAT3_))","v":0.32742023672443071},null,{"$f":"COS(RADIANS(E58))*COS(RADIANS(Sight3!AZ_nord3-180))","v":0.82122175240552087},null,95,-0.99619469809174555,-8.7155742747657944E-2,285,0.96592582628906842,0.25881904510252024,null,112,{"$f":"COS(RADIANS(Sight3!DEC3_))*COS(RADIANS(T58))","v":-0.37016346352605939},{"$f":"COS(RADIANS(Sight3!DEC3_))*SIN(RADIANS(T58))","v":0.91618672218839203},null,null,null,null,112,{"$f":"COS(RADIANS(Sight3!HC3_))*COS(RADIANS(AA58))","v":-0.24639837289212274},{"$f":"COS(RADIANS(Sight3!HC3_))*SIN(RADIANS(AA58))","v":0.60985737344845914}]
[114,-0.40673664307580026,0.91354545764260087,null,-24,{"$f":"COS(RADIANS(E59))*COS(RADIANS(Sight3!LHA3_))","v":0.86883495730779658},-0.40673664307580021,{"$f":"F59*COS(RADIANS(90-Sight3!LAT3_))-G59*SIN(RADIANS(90-Sight3!LAT3_))","v":0.91281938567821252},{"$f":"F59*SIN(RADIANS(90-Sight3!LAT3_))+G59*COS(RADIANS(90-Sight3!LAT3_))","v":0.29507566655124634},null,{"$f":"COS(RADIANS(E59))*COS(RADIANS(Sight3!AZ_nord3-180))","v":0.80914200342486631},null,100,-0.98480775301220802,-0.17364817766693047,300,0.8660254037844386,0.5,null,114,{"$f":"COS(RADIANS(Sight3!DEC3_))*COS(RADIANS(T59))","v":-0.40191242543545036},{"$f":"COS(RADIANS(Sight3!DEC3_))*SIN(RADIANS(T59))","v":0.90271008741705761},null,null,null,null,114,{"$f":"COS(RADIANS(Sight3!HC3_))*COS(RADIANS(AA59))","v":-0.2675319890544785},{"$f":"COS(RADIANS(Sight3!HC3_))*SIN(RADIANS(AA59))","v":0.60088668561209879}]
[116,-0.43837114678907751,0.89879404629916693,null,-26,{"$f":"COS(RADIANS(E60))*COS(RADIANS(Sight3!LHA3_))","v":0.85480550563948543},-0.4383711467890774,{"$f":"F60*COS(RADIANS(90-Sight3!LAT3_))-G60*SIN(RADIANS(90-Sight3!LAT3_))","v":0.92413357392275186},{"$f":"F60*SIN(RADIANS(90-Sight3!LAT3_))+G60*COS(RADIANS(90-Sight3!LAT3_))","v":0.26237159213129141},null,{"$f":"COS(RADIANS(E60))*COS(RADIANS(Sight3!AZ_nord3-180))","v":0.7960764395518094},null,105,-0.96592582628906831,-0.25881904510252079,315,0.70710678118654768,0.70710678118654735,null,116,{"$f":"COS(RADIANS(Sight3!DEC3_))*COS(RADIANS(T60))","v":-0.43317171896431139},{"$f":"COS(RADIANS(Sight3!DEC3_))*SIN(RADIANS(T60))","v":0.88813363945603463},null,null,null,null,116,{"$f":"COS(RADIANS(Sight3!HC3_))*COS(RADIANS(AA60))","v":-0.28833965869831513},{"$f":"COS(RADIANS(Sight3!HC3_))*SIN(RADIANS(AA60))","v":0.59118390990881853}]
[118,-0.46947156278589092,0.88294759285892688,null,-28,{"$f":"COS(RADIANS(E61))*COS(RADIANS(Sight3!LHA3_))","v":0.83973460513524656},-0.46947156278589081,{"$f":"F61*COS(RADIANS(90-Sight3!LAT3_))-G61*SIN(RADIANS(90-Sight3!LAT3_))","v":0.93432184775933091},{"$f":"F61*SIN(RADIANS(90-Sight3!LAT3_))+G61*COS(RADIANS(90-Sight3!LAT3_))","v":0.22934785834156984},null,{"$f":"COS(RADIANS(E61))*COS(RADIANS(Sight3!AZ_nord3-180))","v":0.7820409791633337},null,110,-0.93969262078590843,-0.34202014332566866,330,0.49999999999999972,0.86602540378443882,null,118,{"$f":"COS(RADIANS(Sight3!DEC3_))*COS(RADIANS(T61))","v":-0.46390325947860256},{"$f":"COS(RADIANS(Sight3!DEC3_))*SIN(RADIANS(T61))","v":0.87247513746183425},null,null,null,null,118,{"$f":"COS(RADIANS(Sight3!HC3_))*COS(RADIANS(AA61))","v":-0.30879603088334745},{"$f":"COS(RADIANS(Sight3!HC3_))*SIN(RADIANS(AA61))","v":0.5807608676762146}]
[120,-0.49999999999999978,0.86602540378443871,null,-30,{"$f":"COS(RADIANS(E62))*COS(RADIANS(Sight3!LHA3_))","v":0.82364061736585037},-0.49999999999999994,{"$f":"F62*COS(RADIANS(90-Sight3!LAT3_))-G62*SIN(RADIANS(90-Sight3!LAT3_))","v":0.94337179434566265},{"$f":"F62*SIN(RADIANS(90-Sight3!LAT3_))+G62*COS(RADIANS(90-Sight3!LAT3_))","v":0.19604469951478859},null,{"$f":"COS(RADIANS(E62))*COS(RADIANS(Sight3!AZ_nord3-180))","v":0.76705272230592547},null,115,-0.90630778703665005,-0.42261826174069927,345,0.25881904510252074,0.96592582628906831,null,120,{"$f":"COS(RADIANS(Sight3!DEC3_))*COS(RADIANS(T62))","v":-0.4940696053300378},{"$f":"COS(RADIANS(Sight3!DEC3_))*SIN(RADIANS(T62))","v":0.85575365890712884},null,null,null,null,120,{"$f":"COS(RADIANS(Sight3!HC3_))*COS(RADIANS(AA62))","v":-0.32887618267113022},{"$f":"COS(RADIANS(Sight3!HC3_))*SIN(RADIANS(AA62))","v":0.56963025778570109}]
[122,-0.52991926423320479,0.84804809615642607,null,-32,{"$f":"COS(RADIANS(E63))*COS(RADIANS(Sight3!LHA3_))","v":0.80654315037630486},-0.5299192642332049,{"$f":"F63*COS(RADIANS(90-Sight3!LAT3_))-G63*SIN(RADIANS(90-Sight3!LAT3_))","v":0.95127238771586931},{"$f":"F63*SIN(RADIANS(90-Sight3!LAT3_))+G63*COS(RADIANS(90-Sight3!LAT3_))","v":0.1625026904200193},null,{"$f":"COS(RADIANS(E63))*COS(RADIANS(Sight3!AZ_nord3-180))","v":0.75112992986180149},null,120,-0.8660254037844386,-0.50000000000000011,null,null,null,null,122,{"$f":"COS(RADIANS(Sight3!DEC3_))*COS(RADIANS(T63))","v":-0.52363400347296729},{"$f":"COS(RADIANS(Sight3!DEC3_))*SIN(RADIANS(T63))","v":0.83798957633779114},null,null,null,null,122,{"$f":"COS(RADIANS(Sight3!HC3_))*COS(RADIANS(AA63))","v":-0.34855564948982093},{"$f":"COS(RADIANS(Sight3!HC3_))*SIN(RADIANS(AA63))","v":0.55780564117089027}]
[124,-0.55919290347074668,0.82903757255504174,null,-34,{"$f":"COS(RADIANS(E64))*COS(RADIANS(Sight3!LHA3_))","v":0.78846303479647417},-0.5591929034707469,{"$f":"F64*COS(RADIANS(90-Sight3!LAT3_))-G64*SIN(RADIANS(90-Sight3!LAT3_))","v":0.95801400221392252},{"$f":"F64*SIN(RADIANS(90-Sight3!LAT3_))+G64*COS(RADIANS(90-Sight3!LAT3_))","v":0.12876269682859387},null,{"$f":"COS(RADIANS(E64))*COS(RADIANS(Sight3!AZ_nord3-180))","v":0.73429200130083694},null,125,-0.8191520442889918,-0.57357643635104616,null,null,null,null,124,{"$f":"COS(RADIANS(Sight3!DEC3_))*COS(RADIANS(T64))","v":-0.55256043424229973},{"$f":"COS(RADIANS(Sight3!DEC3_))*SIN(RADIANS(T64))","v":0.81920453255208447},null,null,null,null,124,{"$f":"COS(RADIANS(Sight3!HC3_))*COS(RADIANS(AA64))","v":-0.36781045494049014},{"$f":"COS(RADIANS(Sight3!HC3_))*SIN(RADIANS(AA64))","v":0.54530142430568485}]
[126,-0.58778525229247303,0.80901699437494745,null,-36,{"$f":"COS(RADIANS(E65))*COS(RADIANS(Sight3!LHA3_))","v":0.76942229846216392},-0.58778525229247314,{"$f":"F65*COS(RADIANS(90-Sight3!LAT3_))-G65*SIN(RADIANS(90-Sight3!LAT3_))","v":0.96358842422102242},{"$f":"F65*SIN(RADIANS(90-Sight3!LAT3_))+G65*COS(RADIANS(90-Sight3!LAT3_))","v":9.4865825725455821E-2},null,{"$f":"COS(RADIANS(E65))*COS(RADIANS(Sight3!AZ_nord3-180))","v":0.71655945104529928},null,130,-0.76604444311897801,-0.64278760968653925,null,null,null,null,126,{"$f":"COS(RADIANS(Sight3!DEC3_))*COS(RADIANS(T65))","v":-0.58081365523791795},{"$f":"COS(RADIANS(Sight3!DEC3_))*SIN(RADIANS(T65))","v":0.79942141423224777},null,null,null,null,126,{"$f":"COS(RADIANS(Sight3!HC3_))*COS(RADIANS(AA65))","v":-0.38661714000867164},{"$f":"COS(RADIANS(Sight3!HC3_))*SIN(RADIANS(AA65))","v":0.5321328416522082}]
[128,{"$f":"COS(RADIANS(A66))","v":-0.61566147532565829},{"$f":"SIN(RADIANS(A66))","v":0.78801075360672201},null,-38,{"$f":"COS(RADIANS(E66))*COS(RADIANS(Sight3!LHA3_))","v":0.7494441395775967},-0.61566147532565829,{"$f":"F66*COS(RADIANS(90-Sight3!LAT3_))-G66*SIN(RADIANS(90-Sight3!LAT3_))","v":0.96798886216262692},{"$f":"F66*SIN(RADIANS(90-Sight3!LAT3_))+G66*COS(RADIANS(90-Sight3!LAT3_))","v":6.0853375226631423E-2},null,{"$f":"COS(RADIANS(E66))*COS(RADIANS(Sight3!AZ_nord3-180))","v":0.6979538834761847},null,135,-0.70710678118654768,-0.70710678118654746,null,null,null,null,128,{"$f":"COS(RADIANS(Sight3!DEC3_))*COS(RADIANS(T66))","v":-0.60835924426211385},{"$f":"COS(RADIANS(Sight3!DEC3_))*SIN(RADIANS(T66))","v":0.77866432406059793},null,null,null,null,128,{"$f":"COS(RADIANS(Sight3!HC3_))*COS(RADIANS(AA66))","v":-0.40495279164555764},{"$f":"COS(RADIANS(Sight3!HC3_))*SIN(RADIANS(AA66))","v":0.51831593709995882}]
[{"$f":"SUM(A66+2)","v":130},-0.64278760968653936,0.76604444311897801,null,{"$f":"SUM(E66-2)","v":-40},{"$f":"COS(RADIANS(E67))*COS(RADIANS(Sight3!LHA3_))","v":0.72855289845197424},{"$f":"SIN(RADIANS(E67))","v":-0.64278760968653925},{"$f":"F67*COS(RADIANS(90-Sight3!LAT3_))-G67*SIN(RADIANS(90-Sight3!LAT3_))","v":0.97120995478294014},{"$f":"F67*SIN(RADIANS(90-Sight3!LAT3_))+G67*COS(RADIANS(90-Sight3!LAT3_))","v":2.6766784263837384E-2},null,{"$f":"COS(RADIANS(E67))*COS(RADIANS(Sight3!AZ_nord3-180))","v":0.67849796661160833},null,140,-0.64278760968653947,-0.7660444431189779,null,null,null,null,130,{"$f":"COS(RADIANS(Sight3!DEC3_))*COS(RADIANS(T67))","v":-0.63516364125773406},{"$f":"COS(RADIANS(Sight3!DEC3_))*SIN(RADIANS(T67))","v":0.75695855135412449},null,null,null,null,{"$f":"SUM(AA66+2)","v":130},{"$f":"COS(RADIANS(Sight3!HC3_))*COS(RADIANS(AA67))","v":-0.42279507068401917},{"$f":"COS(RADIANS(Sight3!HC3_))*SIN(RADIANS(AA67))","v":0.50386754441880277}]
[132,-0.66913060635885824,0.74314482547739424,null,-42,{"$f":"COS(RADIANS(E68))*COS(RADIANS(Sight3!LHA3_))","v":0.70677402784455878},-0.66913060635885824,{"$f":"F68*COS(RADIANS(90-Sight3!LAT3_))-G68*SIN(RADIANS(90-Sight3!LAT3_))","v":0.97324777767677517},{"$f":"F68*SIN(RADIANS(90-Sight3!LAT3_))+G68*COS(RADIANS(90-Sight3!LAT3_))","v":-7.3524179024752612E-3},null,{"$f":"COS(RADIANS(E68))*COS(RADIANS(Sight3!AZ_nord3-180))","v":0.65821540448931548},null,145,-0.57357643635104638,-0.81915204428899158,null,null,null,null,132,{"$f":"COS(RADIANS(Sight3!DEC3_))*COS(RADIANS(T68))","v":-0.6611941891959402},{"$f":"COS(RADIANS(Sight3!DEC3_))*SIN(RADIANS(T68))","v":0.73433054125335229},null,null,null,null,132,{"$f":"COS(RADIANS(Sight3!HC3_))*COS(RADIANS(AA68))","v":-0.44012223905544023},{"$f":"COS(RADIANS(Sight3!HC3_))*SIN(RADIANS(AA68))","v":0.48880526674961766}]
[134,-0.69465837045899737,0.71933980033865108,null,-44,{"$f":"COS(RADIANS(E69))*COS(RADIANS(Sight3!LHA3_))","v":0.68413406195440785},-0.69465837045899725,{"$f":"F69*COS(RADIANS(90-Sight3!LAT3_))-G69*SIN(RADIANS(90-Sight3!LAT3_))","v":0.97409984807083871},{"$f":"F69*SIN(RADIANS(90-Sight3!LAT3_))+G69*COS(RADIANS(90-Sight3!LAT3_))","v":-4.1462662280126794E-2},null,{"$f":"COS(RADIANS(E69))*COS(RADIANS(Sight3!AZ_nord3-180))","v":0.63713090828696295},null,150,-0.50000000000000044,-0.86602540378443837,null,null,null,null,134,{"$f":"COS(RADIANS(Sight3!DEC3_))*COS(RADIANS(T69))","v":-0.68641917386376838},{"$f":"COS(RADIANS(Sight3!DEC3_))*SIN(RADIANS(T69))","v":0.71080786250301142},null,null,null,null,134,{"$f":"COS(RADIANS(Sight3!HC3_))*COS(RADIANS(AA69))","v":-0.45691318627420596},{"$f":"COS(RADIANS(Sight3!HC3_))*SIN(RADIANS(AA69))","v":0.47314745515757733}]
[136,-0.71933980033865119,0.69465837045899714,null,-46,{"$f":"COS(RADIANS(E70))*COS(RADIANS(Sight3!LHA3_))","v":0.66066058409253892},-0.71933980033865108,{"$f":"F70*COS(RADIANS(90-Sight3!LAT3_))-G70*SIN(RADIANS(90-Sight3!LAT3_))","v":0.97376512784860669},{"$f":"F70*SIN(RADIANS(90-Sight3!LAT3_))+G70*COS(RADIANS(90-Sight3!LAT3_))","v":-7.5522390790623617E-2},null,{"$f":"COS(RADIANS(E70))*COS(RADIANS(Sight3!AZ_nord3-180))","v":0.61527016621535546},null,155,-0.42261826174069916,-0.90630778703665005,null,null,null,null,136,{"$f":"COS(RADIANS(Sight3!DEC3_))*COS(RADIANS(T70))","v":-0.71080786250301153},{"$f":"COS(RADIANS(Sight3!DEC3_))*SIN(RADIANS(T70))","v":0.68641917386376816},null,null,null,null,136,{"$f":"COS(RADIANS(Sight3!HC3_))*COS(RADIANS(AA70))","v":-0.47314745515757745},{"$f":"COS(RADIANS(Sight3!HC3_))*SIN(RADIANS(AA70))","v":0.4569131862742058}]
[138,-0.74314482547739402,0.66913060635885835,null,-48,{"$f":"COS(RADIANS(E71))*COS(RADIANS(Sight3!LHA3_))","v":0.63638219307591493},-0.74314482547739424,{"$f":"F71*COS(RADIANS(90-Sight3!LAT3_))-G71*SIN(RADIANS(90-Sight3!LAT3_))","v":0.97224402481511052},{"$f":"F71*SIN(RADIANS(90-Sight3!LAT3_))+G71*COS(RADIANS(90-Sight3!LAT3_))","v":-0.10949010690127448},null,{"$f":"COS(RADIANS(E71))*COS(RADIANS(Sight3!AZ_nord3-180))","v":0.59265981222131836},null,160,-0.34202014332566855,-0.93969262078590843,null,null,null,null,138,{"$f":"COS(RADIANS(Sight3!DEC3_))*COS(RADIANS(T71))","v":-0.73433054125335206},{"$f":"COS(RADIANS(Sight3!DEC3_))*SIN(RADIANS(T71))","v":0.66119418919594031},null,null,null,null,138,{"$f":"COS(RADIANS(Sight3!HC3_))*COS(RADIANS(AA71))","v":-0.4888052667496175},{"$f":"COS(RADIANS(Sight3!HC3_))*SIN(RADIANS(AA71))","v":0.44012223905544029}]
[140,-0.7660444431189779,0.64278760968653947,null,-50,{"$f":"COS(RADIANS(E72))*COS(RADIANS(Sight3!LHA3_))","v":0.61132846838418997},-0.76604444311897801,{"$f":"F72*COS(RADIANS(90-Sight3!LAT3_))-G72*SIN(RADIANS(90-Sight3!LAT3_))","v":0.96953839220008819},{"$f":"F72*SIN(RADIANS(90-Sight3!LAT3_))+G72*COS(RADIANS(90-Sight3!LAT3_))","v":-0.14332442618232416},null,{"$f":"COS(RADIANS(E72))*COS(RADIANS(Sight3!AZ_nord3-180))","v":0.56932739353833506},null,165,-0.25881904510252063,-0.96592582628906831,null,null,null,null,140,{"$f":"COS(RADIANS(Sight3!DEC3_))*COS(RADIANS(T72))","v":-0.75695855135412438},{"$f":"COS(RADIANS(Sight3!DEC3_))*SIN(RADIANS(T72))","v":0.63516364125773417},null,null,null,null,140,{"$f":"COS(RADIANS(Sight3!HC3_))*COS(RADIANS(AA72))","v":-0.50386754441880266},{"$f":"COS(RADIANS(Sight3!HC3_))*SIN(RADIANS(AA72))","v":0.42279507068401923}]
[142,-0.7880107536067219,0.6156614753256584,null,-52,{"$f":"COS(RADIANS(E73))*COS(RADIANS(Sight3!LHA3_))","v":0.58552993412167043},-0.78801075360672201,{"$f":"F73*COS(RADIANS(90-Sight3!LAT3_))-G73*SIN(RADIANS(90-Sight3!LAT3_))","v":0.96565152640011065},{"$f":"F73*SIN(RADIANS(90-Sight3!LAT3_))+G73*COS(RADIANS(90-Sight3!LAT3_))","v":-0.17698412672750624},null,{"$f":"COS(RADIANS(E73))*COS(RADIANS(Sight3!AZ_nord3-180))","v":0.54530133712448747},null,170,-0.17364817766693033,-0.98480775301220802,null,null,null,null,142,{"$f":"COS(RADIANS(Sight3!DEC3_))*COS(RADIANS(T73))","v":-0.77866432406059782},{"$f":"COS(RADIANS(Sight3!DEC3_))*SIN(RADIANS(T73))","v":0.60835924426211396},null,null,null,null,142,{"$f":"COS(RADIANS(Sight3!HC3_))*COS(RADIANS(AA73))","v":-0.51831593709995882},{"$f":"COS(RADIANS(Sight3!HC3_))*SIN(RADIANS(AA73))","v":0.40495279164555775}]
[144,-0.80901699437494734,0.58778525229247325,null,-54,{"$f":"COS(RADIANS(E74))*COS(RADIANS(Sight3!LHA3_))","v":0.55901802182839588},-0.80901699437494745,{"$f":"F74*COS(RADIANS(90-Sight3!LAT3_))-G74*SIN(RADIANS(90-Sight3!LAT3_))","v":0.96058816296242933},{"$f":"F74*SIN(RADIANS(90-Sight3!LAT3_))+G74*COS(RADIANS(90-Sight3!LAT3_))","v":-0.21042819937658547},null,{"$f":"COS(RADIANS(E74))*COS(RADIANS(Sight3!AZ_nord3-180))","v":0.52061091502858536},null,175,-8.7155742747658249E-2,-0.99619469809174555,null,null,null,null,144,{"$f":"COS(RADIANS(Sight3!DEC3_))*COS(RADIANS(T74))","v":-0.79942141423224766},{"$f":"COS(RADIANS(Sight3!DEC3_))*SIN(RADIANS(T74))","v":0.58081365523791817},null,null,null,null,144,{"$f":"COS(RADIANS(Sight3!HC3_))*COS(RADIANS(AA74))","v":-0.53213284165220809},{"$f":"COS(RADIANS(Sight3!HC3_))*SIN(RADIANS(AA74))","v":0.38661714000867181}]
[146,-0.82903757255504162,0.5591929034707469,null,-56,{"$f":"COS(RADIANS(E75))*COS(RADIANS(Sight3!LHA3_))","v":0.53182503218564836},-0.82903757255504174,{"$f":"F75*COS(RADIANS(90-Sight3!LAT3_))-G75*SIN(RADIANS(90-Sight3!LAT3_))","v":0.95435447081544145},{"$f":"F75*SIN(RADIANS(90-Sight3!LAT3_))+G75*COS(RADIANS(90-Sight3!LAT3_))","v":-0.24361589767870379},null,{"$f":"COS(RADIANS(E75))*COS(RADIANS(Sight3!AZ_nord3-180))","v":0.49528620872668472},null,180,-1.83772268236293E-16,-1,null,null,null,null,146,{"$f":"COS(RADIANS(Sight3!DEC3_))*COS(RADIANS(T75))","v":-0.81920453255208436},{"$f":"COS(RADIANS(Sight3!DEC3_))*SIN(RADIANS(T75))","v":0.55256043424229995},null,null,null,null,146,{"$f":"COS(RADIANS(Sight3!HC3_))*COS(RADIANS(AA75))","v":-0.54530142430568473},{"$f":"COS(RADIANS(Sight3!HC3_))*SIN(RADIANS(AA75))","v":0.36781045494049031}]
[148,-0.84804809615642596,0.5299192642332049,null,-58,{"$f":"COS(RADIANS(E76))*COS(RADIANS(Sight3!LHA3_))","v":0.50398409566254887},-0.84804809615642596,{"$f":"F76*COS(RADIANS(90-Sight3!LAT3_))-G76*SIN(RADIANS(90-Sight3!LAT3_))","v":0.94695804475280176},{"$f":"F76*SIN(RADIANS(90-Sight3!LAT3_))+G76*COS(RADIANS(90-Sight3!LAT3_))","v":-0.27650678753565266},null,{"$f":"COS(RADIANS(E76))*COS(RADIANS(Sight3!AZ_nord3-180))","v":0.46935807247244249},null,185,8.7155742747657888E-2,-0.99619469809174555,null,null,null,null,148,{"$f":"COS(RADIANS(Sight3!DEC3_))*COS(RADIANS(T76))","v":-0.83798957633779103},{"$f":"COS(RADIANS(Sight3!DEC3_))*SIN(RADIANS(T76))","v":0.5236340034729674},null,null,null,null,148,{"$f":"COS(RADIANS(Sight3!HC3_))*COS(RADIANS(AA76))","v":-0.55780564117089015},{"$f":"COS(RADIANS(Sight3!HC3_))*SIN(RADIANS(AA76))","v":0.34855564948982104}]
[150,-0.86602540378443871,0.49999999999999994,null,-60,{"$f":"COS(RADIANS(E77))*COS(RADIANS(Sight3!LHA3_))","v":0.47552913215168335},-0.8660254037844386,{"$f":"F77*COS(RADIANS(90-Sight3!LAT3_))-G77*SIN(RADIANS(90-Sight3!LAT3_))","v":0.93840789618033549},{"$f":"F77*SIN(RADIANS(90-Sight3!LAT3_))+G77*COS(RADIANS(90-Sight3!LAT3_))","v":-0.30906079646459478},null,{"$f":"COS(RADIANS(E77))*COS(RADIANS(Sight3!AZ_nord3-180))","v":0.44285809570596141},null,190,0.17364817766692997,-0.98480775301220813,null,null,null,null,150,{"$f":"COS(RADIANS(Sight3!DEC3_))*COS(RADIANS(T77))","v":-0.85575365890712884},{"$f":"COS(RADIANS(Sight3!DEC3_))*SIN(RADIANS(T77))","v":0.49406960533003796},null,null,null,null,150,{"$f":"COS(RADIANS(Sight3!HC3_))*COS(RADIANS(AA77))","v":-0.56963025778570109},{"$f":"COS(RADIANS(Sight3!HC3_))*SIN(RADIANS(AA77))","v":0.32887618267113033}]
[152,-0.88294759285892699,0.46947156278589069,null,-62,{"$f":"COS(RADIANS(E78))*COS(RADIANS(Sight3!LHA3_))","v":0.44649480964293831},-0.88294759285892688,{"$f":"F78*COS(RADIANS(90-Sight3!LAT3_))-G78*SIN(RADIANS(90-Sight3!LAT3_))","v":0.92871444213702858},{"$f":"F78*SIN(RADIANS(90-Sight3!LAT3_))+G78*COS(RADIANS(90-Sight3!LAT3_))","v":-0.3412382624202111},null,{"$f":"COS(RADIANS(E78))*COS(RADIANS(Sight3!AZ_nord3-180))","v":0.41581856456692257},null,195,0.2588190451025203,-0.96592582628906842,null,null,null,null,152,{"$f":"COS(RADIANS(Sight3!DEC3_))*COS(RADIANS(T78))","v":-0.87247513746183436},{"$f":"COS(RADIANS(Sight3!DEC3_))*SIN(RADIANS(T78))","v":0.46390325947860234},null,null,null,null,152,{"$f":"COS(RADIANS(Sight3!HC3_))*COS(RADIANS(AA78))","v":-0.58076086767621471},{"$f":"COS(RADIANS(Sight3!HC3_))*SIN(RADIANS(AA78))","v":0.30879603088334728}]
[154,-0.89879404629916704,0.43837114678907729,null,-64,{"$f":"COS(RADIANS(E79))*COS(RADIANS(Sight3!LHA3_))","v":0.4169165019858963},-0.89879404629916704,{"$f":"F79*COS(RADIANS(90-Sight3!LAT3_))-G79*SIN(RADIANS(90-Sight3!LAT3_))","v":0.91788949260347064},{"$f":"F79*SIN(RADIANS(90-Sight3!LAT3_))+G79*COS(RADIANS(90-Sight3!LAT3_))","v":-0.37299998211679325},null,{"$f":"COS(RADIANS(E79))*COS(RADIANS(Sight3!AZ_nord3-180))","v":0.38827242255889854},null,200,0.34202014332566899,-0.93969262078590832,null,null,null,null,154,{"$f":"COS(RADIANS(Sight3!DEC3_))*COS(RADIANS(T79))","v":-0.88813363945603474},{"$f":"COS(RADIANS(Sight3!DEC3_))*SIN(RADIANS(T79))","v":0.43317171896431117},null,null,null,null,154,{"$f":"COS(RADIANS(Sight3!HC3_))*COS(RADIANS(AA79))","v":-0.59118390990881853},{"$f":"COS(RADIANS(Sight3!HC3_))*SIN(RADIANS(AA79))","v":0.28833965869831502}]
[156,-0.91354545764260076,0.40673664307580043,null,-66,{"$f":"COS(RADIANS(E80))*COS(RADIANS(Sight3!LHA3_))","v":0.38683024579224845},-0.91354545764260087,{"$f":"F80*COS(RADIANS(90-Sight3!LAT3_))-G80*SIN(RADIANS(90-Sight3!LAT3_))","v":0.9059462361132129},{"$f":"F80*SIN(RADIANS(90-Sight3!LAT3_))+G80*COS(RADIANS(90-Sight3!LAT3_))","v":-0.40430725879140866},null,{"$f":"COS(RADIANS(E80))*COS(RADIANS(Sight3!AZ_nord3-180))","v":0.3602532304127683},null,205,0.42261826174069961,-0.90630778703664994,null,null,null,null,156,{"$f":"COS(RADIANS(Sight3!DEC3_))*COS(RADIANS(T80))","v":-0.90271008741705749},{"$f":"COS(RADIANS(Sight3!DEC3_))*SIN(RADIANS(T80))","v":0.40191242543545053},null,null,null,null,156,{"$f":"COS(RADIANS(Sight3!HC3_))*COS(RADIANS(AA80))","v":-0.60088668561209879},{"$f":"COS(RADIANS(Sight3!HC3_))*SIN(RADIANS(AA80))","v":0.26753198905447861}]
[158,-0.92718385456678731,0.37460659341591224,null,-68,{"$f":"COS(RADIANS(E81))*COS(RADIANS(Sight3!LHA3_))","v":0.35627269653073412},-0.92718385456678742,{"$f":"F81*COS(RADIANS(90-Sight3!LAT3_))-G81*SIN(RADIANS(90-Sight3!LAT3_))","v":0.89289922368457098},{"$f":"F81*SIN(RADIANS(90-Sight3!LAT3_))+G81*COS(RADIANS(90-Sight3!LAT3_))","v":-0.43512194934994569},null,{"$f":"COS(RADIANS(E81))*COS(RADIANS(Sight3!AZ_nord3-180))","v":0.33179512519813614},null,210,0.50000000000000011,-0.8660254037844386,null,null,null,null,158,{"$f":"COS(RADIANS(Sight3!DEC3_))*COS(RADIANS(T81))","v":-0.91618672218839192},{"$f":"COS(RADIANS(Sight3!DEC3_))*SIN(RADIANS(T81))","v":0.37016346352605956},null,null,null,null,158,{"$f":"COS(RADIANS(Sight3!HC3_))*COS(RADIANS(AA81))","v":-0.60985737344845903},{"$f":"COS(RADIANS(Sight3!HC3_))*SIN(RADIANS(AA81))","v":0.24639837289212285}]
[160,-0.93969262078590832,0.34202014332566888,null,-70,{"$f":"COS(RADIANS(E82))*COS(RADIANS(Sight3!LHA3_))","v":0.32528108386809923},-0.93969262078590832,{"$f":"F82*COS(RADIANS(90-Sight3!LAT3_))-G82*SIN(RADIANS(90-Sight3!LAT3_))","v":0.87876435109245088},{"$f":"F82*SIN(RADIANS(90-Sight3!LAT3_))+G82*COS(RADIANS(90-Sight3!LAT3_))","v":-0.4654065108385978},null,{"$f":"COS(RADIANS(E82))*COS(RADIANS(Sight3!AZ_nord3-180))","v":0.3029327787325713},null,215,0.57357643635104605,-0.8191520442889918,null,null,null,null,160,{"$f":"COS(RADIANS(Sight3!DEC3_))*COS(RADIANS(T82))","v":-0.92854712456648558},{"$f":"COS(RADIANS(Sight3!DEC3_))*SIN(RADIANS(T82))","v":0.33796351445567252},null,null,null,null,160,{"$f":"COS(RADIANS(Sight3!HC3_))*COS(RADIANS(AA82))","v":-0.61808504401659925},{"$f":"COS(RADIANS(Sight3!HC3_))*SIN(RADIANS(AA82))","v":0.22496455826715775}]
[162,-0.95105651629515353,0.30901699437494751,null,-72,{"$f":"COS(RADIANS(E83))*COS(RADIANS(Sight3!LHA3_))","v":0.29389316631048068},-0.95105651629515353,{"$f":"F83*COS(RADIANS(90-Sight3!LAT3_))-G83*SIN(RADIANS(90-Sight3!LAT3_))","v":0.86355883950179613},{"$f":"F83*SIN(RADIANS(90-Sight3!LAT3_))+G83*COS(RADIANS(90-Sight3!LAT3_))","v":-0.4951240461841705},null,{"$f":"COS(RADIANS(E83))*COS(RADIANS(Sight3!AZ_nord3-180))","v":0.27370135533933798},null,220,0.64278760968653925,-0.76604444311897812,null,null,null,null,162,{"$f":"COS(RADIANS(Sight3!DEC3_))*COS(RADIANS(T83))","v":-0.93977623530501475},{"$f":"COS(RADIANS(Sight3!DEC3_))*SIN(RADIANS(T83))","v":0.30535180890220981},null,null,null,null,162,{"$f":"COS(RADIANS(Sight3!HC3_))*COS(RADIANS(AA83))","v":-0.62555967316730765},{"$f":"COS(RADIANS(Sight3!HC3_))*SIN(RADIANS(AA83))","v":0.20325665898107781}]
[164,-0.96126169593831889,0.27563735581699922,null,-74,{"$f":"COS(RADIANS(E84))*COS(RADIANS(Sight3!LHA3_))","v":0.26214718520048469},-0.96126169593831889,{"$f":"F84*COS(RADIANS(90-Sight3!LAT3_))-G84*SIN(RADIANS(90-Sight3!LAT3_))","v":0.84730121448625018},{"$f":"F84*SIN(RADIANS(90-Sight3!LAT3_))+G84*COS(RADIANS(90-Sight3!LAT3_))","v":-0.52423834914748046},null,{"$f":"COS(RADIANS(E84))*COS(RADIANS(Sight3!AZ_nord3-180))","v":0.24413646900508545},null,225,0.70710678118654735,-0.70710678118654768,null,null,null,null,164,{"$f":"COS(RADIANS(Sight3!DEC3_))*COS(RADIANS(T84))","v":-0.94986037346225649},{"$f":"COS(RADIANS(Sight3!DEC3_))*SIN(RADIANS(T84))","v":0.27236807920544015},null,null,null,null,164,{"$f":"COS(RADIANS(Sight3!HC3_))*COS(RADIANS(AA84))","v":-0.63227215421634231},{"$f":"COS(RADIANS(Sight3!HC3_))*SIN(RADIANS(AA84))","v":0.1813011227653176}]
[166,-0.97029572627599647,0.24192189559966773,null,-76,{"$f":"COS(RADIANS(E85))*COS(RADIANS(Sight3!LHA3_))","v":0.23008181812600018},-0.97029572627599647,{"$f":"F85*COS(RADIANS(90-Sight3!LAT3_))-G85*SIN(RADIANS(90-Sight3!LAT3_))","v":0.83001128345759945},{"$f":"F85*SIN(RADIANS(90-Sight3!LAT3_))+G85*COS(RADIANS(90-Sight3!LAT3_))","v":-0.55271394843508137},null,{"$f":"COS(RADIANS(E85))*COS(RADIANS(Sight3!AZ_nord3-180))","v":0.21427413998969042},null,230,0.76604444311897779,-0.64278760968653958,null,null,null,null,166,{"$f":"COS(RADIANS(Sight3!DEC3_))*COS(RADIANS(T85))","v":-0.95878725306920831},{"$f":"COS(RADIANS(Sight3!DEC3_))*SIN(RADIANS(T85))","v":0.23905251095924498},null,null,null,null,166,{"$f":"COS(RADIANS(Sight3!HC3_))*COS(RADIANS(AA85))","v":-0.63821430903952348},{"$f":"COS(RADIANS(Sight3!HC3_))*SIN(RADIANS(AA85))","v":0.15912469905876492}]
[168,-0.97814760073380569,0.20791169081775931,null,-78,{"$f":"COS(RADIANS(E86))*COS(RADIANS(Sight3!LHA3_))","v":0.19773613179751648},-0.97814760073380558,{"$f":"F86*COS(RADIANS(90-Sight3!LAT3_))-G86*SIN(RADIANS(90-Sight3!LAT3_))","v":0.81171011153349282},{"$f":"F86*SIN(RADIANS(90-Sight3!LAT3_))+G86*COS(RADIANS(90-Sight3!LAT3_))","v":-0.58051615091557074},null,{"$f":"COS(RADIANS(E86))*COS(RADIANS(Sight3!AZ_nord3-180))","v":0.1841507509411191},null,235,0.81915204428899158,-0.57357643635104649,null,null,null,null,168,{"$f":"COS(RADIANS(Sight3!DEC3_))*COS(RADIANS(T86))","v":-0.96654599809815001},{"$f":"COS(RADIANS(Sight3!DEC3_))*SIN(RADIANS(T86))","v":0.20544569405166246},null,null,null,null,168,{"$f":"COS(RADIANS(Sight3!HC3_))*COS(RADIANS(AA86))","v":-0.64337889803651804},{"$f":"COS(RADIANS(Sight3!HC3_))*SIN(RADIANS(AA86))","v":0.13675440641768999}]
[170,-0.98480775301220802,0.17364817766693028,null,-80,{"$f":"COS(RADIANS(E87))*COS(RADIANS(Sight3!LHA3_))","v":0.16514953445135344},-0.98480775301220802,{"$f":"F87*COS(RADIANS(90-Sight3!LAT3_))-G87*SIN(RADIANS(90-Sight3!LAT3_))","v":0.79241999587283996},{"$f":"F87*SIN(RADIANS(90-Sight3!LAT3_))+G87*COS(RADIANS(90-Sight3!LAT3_))","v":-0.60761108388782792},null,{"$f":"COS(RADIANS(E87))*COS(RADIANS(Sight3!AZ_nord3-180))","v":0.15380300256877449},null,240,0.86602540378443837,-0.50000000000000044,null,null,null,null,170,{"$f":"COS(RADIANS(Sight3!DEC3_))*COS(RADIANS(T87))","v":-0.97312715571340636},{"$f":"COS(RADIANS(Sight3!DEC3_))*SIN(RADIANS(T87))","v":0.17158857321236112},null,null,null,null,170,{"$f":"COS(RADIANS(Sight3!HC3_))*COS(RADIANS(AA87))","v":-0.64775962895117678},{"$f":"COS(RADIANS(Sight3!HC3_))*SIN(RADIANS(AA87))","v":0.11421749959779653}]
[172,-0.99026806874157036,0.13917310096006533,null,-82,{"$f":"COS(RADIANS(E88))*COS(RADIANS(Sight3!LHA3_))","v":0.13236172783679706},-0.99026806874157036,{"$f":"F88*COS(RADIANS(90-Sight3!LAT3_))-G88*SIN(RADIANS(90-Sight3!LAT3_))","v":0.77216443851015915},{"$f":"F88*SIN(RADIANS(90-Sight3!LAT3_))+G88*COS(RADIANS(90-Sight3!LAT3_))","v":-0.63396573634968023},null,{"$f":"COS(RADIANS(E88))*COS(RADIANS(Sight3!AZ_nord3-180))","v":0.12326786892933617},null,245,0.90630778703665005,-0.42261826174069922,null,null,null,null,172,{"$f":"COS(RADIANS(Sight3!DEC3_))*COS(RADIANS(T88))","v":-0.9785227077881733},{"$f":"COS(RADIANS(Sight3!DEC3_))*SIN(RADIANS(T88))","v":0.13752239812779402},null,null,null,null,172,{"$f":"COS(RADIANS(Sight3!HC3_))*COS(RADIANS(AA88))","v":-0.65135116453768038},{"$f":"COS(RADIANS(Sight3!HC3_))*SIN(RADIANS(AA88))","v":9.1541436348500232E-2}]
[174,-0.99452189536827329,0.10452846326765373,null,-84,{"$f":"COS(RADIANS(E89))*COS(RADIANS(Sight3!LHA3_))","v":9.941265884563269E-2},-0.99452189536827329,{"$f":"F89*COS(RADIANS(90-Sight3!LAT3_))-G89*SIN(RADIANS(90-Sight3!LAT3_))","v":0.75096811772196737},{"$f":"F89*SIN(RADIANS(90-Sight3!LAT3_))+G89*COS(RADIANS(90-Sight3!LAT3_))","v":-0.65954799921672591},null,{"$f":"COS(RADIANS(E89))*COS(RADIANS(Sight3!AZ_nord3-180))","v":9.2582552379567071E-2},null,250,0.93969262078590843,-0.3420201433256686,null,null,null,null,174,{"$f":"COS(RADIANS(Sight3!DEC3_))*COS(RADIANS(T89))","v":-0.98272608067336831},{"$f":"COS(RADIANS(Sight3!DEC3_))*SIN(RADIANS(T89))","v":0.10328867318481011},null,null,null,null,174,{"$f":"COS(RADIANS(Sight3!HC3_))*COS(RADIANS(AA89))","v":-0.65414912906315015},{"$f":"COS(RADIANS(Sight3!HC3_))*SIN(RADIANS(AA89))","v":6.875384395989087E-2}]
[176,-0.9975640502598242,6.9756473744125524E-2,null,-86,{"$f":"COS(RADIANS(E90))*COS(RADIANS(Sight3!LHA3_))","v":6.6342470843011106E-2},-0.9975640502598242,{"$f":"F90*COS(RADIANS(90-Sight3!LAT3_))-G90*SIN(RADIANS(90-Sight3!LAT3_))","v":0.72885685796010191},{"$f":"F90*SIN(RADIANS(90-Sight3!LAT3_))+G90*COS(RADIANS(90-Sight3!LAT3_))","v":-0.68432670444230692},null,{"$f":"COS(RADIANS(E90))*COS(RADIANS(Sight3!AZ_nord3-180))","v":6.1784438250972379E-2},null,255,0.96592582628906831,-0.25881904510252068,null,null,null,null,176,{"$f":"COS(RADIANS(Sight3!DEC3_))*COS(RADIANS(T90))","v":-0.98573215320661112},{"$f":"COS(RADIANS(Sight3!DEC3_))*SIN(RADIANS(T90))","v":6.8929106903950516E-2},null,null,null,null,176,{"$f":"COS(RADIANS(Sight3!HC3_))*COS(RADIANS(AA90))","v":-0.65615011363880527},{"$f":"COS(RADIANS(Sight3!HC3_))*SIN(RADIANS(AA90))","v":4.5882485603133877E-2}]
[178,-0.99939082701909576,3.4899496702501143E-2,null,-88,{"$f":"COS(RADIANS(E91))*COS(RADIANS(Sight3!LHA3_))","v":3.3191454758941738E-2},-0.99939082701909576,{"$f":"F91*COS(RADIANS(90-Sight3!LAT3_))-G91*SIN(RADIANS(90-Sight3!LAT3_))","v":0.70585759838860462},{"$f":"F91*SIN(RADIANS(90-Sight3!LAT3_))+G91*COS(RADIANS(90-Sight3!LAT3_))","v":-0.70827166299097288},null,{"$f":"COS(RADIANS(E91))*COS(RADIANS(Sight3!AZ_nord3-180))","v":3.0911049301532208E-2},null,260,0.98480775301220802,-0.17364817766693039,null,null,null,null,178,{"$f":"COS(RADIANS(Sight3!DEC3_))*COS(RADIANS(T91))","v":-0.98753726295156985},{"$f":"COS(RADIANS(Sight3!DEC3_))*SIN(RADIANS(T91))","v":3.4485561124043405E-2},null,null,null,null,178,{"$f":"COS(RADIANS(Sight3!HC3_))*COS(RADIANS(AA91))","v":-0.65735168037316838},{"$f":"COS(RADIANS(Sight3!HC3_))*SIN(RADIANS(AA91))","v":2.2955226505324559E-2}]
[180,-1,1.22514845490862E-16,null,-90,{"$f":"COS(RADIANS(E92))*COS(RADIANS(Sight3!LHA3_))","v":5.8259378151967171E-17},-1,{"$f":"F92*COS(RADIANS(90-Sight3!LAT3_))-G92*SIN(RADIANS(90-Sight3!LAT3_))","v":0.68199836006249848},{"$f":"F92*SIN(RADIANS(90-Sight3!LAT3_))+G92*COS(RADIANS(90-Sight3!LAT3_))","v":-0.73135370161917046},null,{"$f":"COS(RADIANS(E92))*COS(RADIANS(Sight3!AZ_nord3-180))","v":5.4256691169793224E-17},null,265,0.99619469809174555,-8.7155742747658319E-2,null,null,null,null,180,{"$f":"COS(RADIANS(Sight3!DEC3_))*COS(RADIANS(T92))","v":-0.98813921066007604},{"$f":"COS(RADIANS(Sight3!DEC3_))*SIN(RADIANS(T92))","v":1.2106172271748156E-16},null,null,null,null,180,{"$f":"COS(RADIANS(Sight3!HC3_))*COS(RADIANS(AA92))","v":-0.65775236534226078},{"$f":"COS(RADIANS(Sight3!HC3_))*SIN(RADIANS(AA92))","v":8.0584429411156095E-17}]
[182,-0.99939082701909576,-3.48994967025009E-2,null,-92,{"$f":"COS(RADIANS(E93))*COS(RADIANS(Sight3!LHA3_))","v":-3.319145475894162E-2},-0.99939082701909576,{"$f":"F93*COS(RADIANS(90-Sight3!LAT3_))-G93*SIN(RADIANS(90-Sight3!LAT3_))","v":0.65730821178845023},{"$f":"F93*SIN(RADIANS(90-Sight3!LAT3_))+G93*COS(RADIANS(90-Sight3!LAT3_))","v":-0.75354469841834659},null,{"$f":"COS(RADIANS(E93))*COS(RADIANS(Sight3!AZ_nord3-180))","v":-3.0911049301532097E-2},null,270,1,-2.45029690981724E-16,null,null,null,null,182,{"$f":"COS(RADIANS(Sight3!DEC3_))*COS(RADIANS(T93))","v":-0.98753726295156985},{"$f":"COS(RADIANS(Sight3!DEC3_))*SIN(RADIANS(T93))","v":-3.4485561124043163E-2},null,null,null,null,182,{"$f":"COS(RADIANS(Sight3!HC3_))*COS(RADIANS(AA93))","v":-0.65735168037316838},{"$f":"COS(RADIANS(Sight3!HC3_))*SIN(RADIANS(AA93))","v":-2.2955226505324396E-2}]
[184,-0.9975640502598242,-6.9756473744125275E-2,null,-94,{"$f":"COS(RADIANS(E94))*COS(RADIANS(Sight3!LHA3_))","v":-6.6342470843011189E-2},-0.9975640502598242,{"$f":"F94*COS(RADIANS(90-Sight3!LAT3_))-G94*SIN(RADIANS(90-Sight3!LAT3_))","v":0.63181723470890572},{"$f":"F94*SIN(RADIANS(90-Sight3!LAT3_))+G94*COS(RADIANS(90-Sight3!LAT3_))","v":-0.77481761707716235},null,{"$f":"COS(RADIANS(E94))*COS(RADIANS(Sight3!AZ_nord3-180))","v":-6.1784438250972462E-2},null,275,0.99619469809174555,8.7155742747657833E-2,null,null,null,null,184,{"$f":"COS(RADIANS(Sight3!DEC3_))*COS(RADIANS(T94))","v":-0.98573215320661112},{"$f":"COS(RADIANS(Sight3!DEC3_))*SIN(RADIANS(T94))","v":-6.8929106903950266E-2},null,null,null,null,184,{"$f":"COS(RADIANS(Sight3!HC3_))*COS(RADIANS(AA94))","v":-0.65615011363880527},{"$f":"COS(RADIANS(Sight3!HC3_))*SIN(RADIANS(AA94))","v":-4.588248560313371E-2}]
[186,-0.99452189536827329,-0.1045284632676535,null,-96,{"$f":"COS(RADIANS(E95))*COS(RADIANS(Sight3!LHA3_))","v":-9.9412658845632787E-2},-0.99452189536827329,{"$f":"F95*COS(RADIANS(90-Sight3!LAT3_))-G95*SIN(RADIANS(90-Sight3!LAT3_))","v":0.60555648565285281},{"$f":"F95*SIN(RADIANS(90-Sight3!LAT3_))+G95*COS(RADIANS(90-Sight3!LAT3_))","v":-0.79514653982107419},null,{"$f":"COS(RADIANS(E95))*COS(RADIANS(Sight3!AZ_nord3-180))","v":-9.2582552379567154E-2},null,280,0.98480775301220813,0.17364817766692991,null,null,null,null,186,{"$f":"COS(RADIANS(Sight3!DEC3_))*COS(RADIANS(T95))","v":-0.98272608067336831},{"$f":"COS(RADIANS(Sight3!DEC3_))*SIN(RADIANS(T95))","v":-0.10328867318480989},null,null,null,null,186,{"$f":"COS(RADIANS(Sight3!HC3_))*COS(RADIANS(AA95))","v":-0.65414912906315015},{"$f":"COS(RADIANS(Sight3!HC3_))*SIN(RADIANS(AA95))","v":-6.8753843959890704E-2}]
[188,-0.99026806874157025,-0.13917310096006552,null,-98,{"$f":"COS(RADIANS(E96))*COS(RADIANS(Sight3!LHA3_))","v":-0.13236172783679695},-0.99026806874157036,{"$f":"F96*COS(RADIANS(90-Sight3!LAT3_))-G96*SIN(RADIANS(90-Sight3!LAT3_))","v":0.5785579592978578},{"$f":"F96*SIN(RADIANS(90-Sight3!LAT3_))+G96*COS(RADIANS(90-Sight3!LAT3_))","v":-0.81450669898914885},null,{"$f":"COS(RADIANS(E96))*COS(RADIANS(Sight3!AZ_nord3-180))","v":-0.12326786892933607},null,285,0.96592582628906842,0.25881904510252024,null,null,null,null,188,{"$f":"COS(RADIANS(Sight3!DEC3_))*COS(RADIANS(T96))","v":-0.97852270778817318},{"$f":"COS(RADIANS(Sight3!DEC3_))*SIN(RADIANS(T96))","v":-0.13752239812779421},null,null,null,null,188,{"$f":"COS(RADIANS(Sight3!HC3_))*COS(RADIANS(AA96))","v":-0.65135116453768038},{"$f":"COS(RADIANS(Sight3!HC3_))*SIN(RADIANS(AA96))","v":-9.1541436348500357E-2}]
[190,-0.98480775301220802,-0.17364817766693047,null,-100,{"$f":"COS(RADIANS(E97))*COS(RADIANS(Sight3!LHA3_))","v":-0.16514953445135333},-0.98480775301220802,{"$f":"F97*COS(RADIANS(90-Sight3!LAT3_))-G97*SIN(RADIANS(90-Sight3!LAT3_))","v":0.55085454918947996},{"$f":"F97*SIN(RADIANS(90-Sight3!LAT3_))+G97*COS(RADIANS(90-Sight3!LAT3_))","v":-0.83287450720964407},null,{"$f":"COS(RADIANS(E97))*COS(RADIANS(Sight3!AZ_nord3-180))","v":-0.15380300256877438},null,290,0.93969262078590832,0.34202014332566893,null,null,null,null,190,{"$f":"COS(RADIANS(Sight3!DEC3_))*COS(RADIANS(T97))","v":-0.97312715571340636},{"$f":"COS(RADIANS(Sight3!DEC3_))*SIN(RADIANS(T97))","v":-0.17158857321236132},null,null,null,null,190,{"$f":"COS(RADIANS(Sight3!HC3_))*COS(RADIANS(AA97))","v":-0.64775962895117678},{"$f":"COS(RADIANS(Sight3!HC3_))*SIN(RADIANS(AA97))","v":-0.11421749959779666}]
[192,-0.97814760073380558,-0.20791169081775951,null,-102,{"$f":"COS(RADIANS(E98))*COS(RADIANS(Sight3!LHA3_))","v":-0.19773613179751637},-0.97814760073380569,{"$f":"F98*COS(RADIANS(90-Sight3!LAT3_))-G98*SIN(RADIANS(90-Sight3!LAT3_))","v":0.52248000766555325},{"$f":"F98*SIN(RADIANS(90-Sight3!LAT3_))+G98*COS(RADIANS(90-Sight3!LAT3_))","v":-0.85022758613758742},null,{"$f":"COS(RADIANS(E98))*COS(RADIANS(Sight3!AZ_nord3-180))","v":-0.18415075094111899},null,295,0.90630778703664994,0.42261826174069955,null,null,null,null,192,{"$f":"COS(RADIANS(Sight3!DEC3_))*COS(RADIANS(T98))","v":-0.96654599809814989},{"$f":"COS(RADIANS(Sight3!DEC3_))*SIN(RADIANS(T98))","v":-0.20544569405166266},null,null,null,null,192,{"$f":"COS(RADIANS(Sight3!HC3_))*COS(RADIANS(AA98))","v":-0.64337889803651793},{"$f":"COS(RADIANS(Sight3!HC3_))*SIN(RADIANS(AA98))","v":-0.13675440641769013}]
[194,-0.97029572627599647,-0.24192189559966751,null,-104,{"$f":"COS(RADIANS(E99))*COS(RADIANS(Sight3!LHA3_))","v":-0.23008181812600029},-0.97029572627599647,{"$f":"F99*COS(RADIANS(90-Sight3!LAT3_))-G99*SIN(RADIANS(90-Sight3!LAT3_))","v":0.4934689047341615},{"$f":"F99*SIN(RADIANS(90-Sight3!LAT3_))+G99*COS(RADIANS(90-Sight3!LAT3_))","v":-0.86654479371934168},null,{"$f":"COS(RADIANS(E99))*COS(RADIANS(Sight3!AZ_nord3-180))","v":-0.2142741399896905},null,300,0.8660254037844386,0.5,null,null,null,null,{"$f":"SUM(T98+2)","v":194},{"$f":"COS(RADIANS(Sight3!DEC3_))*COS(RADIANS(T99))","v":-0.95878725306920831},{"$f":"COS(RADIANS(Sight3!DEC3_))*SIN(RADIANS(T99))","v":-0.23905251095924476},null,null,null,null,194,{"$f":"COS(RADIANS(Sight3!HC3_))*COS(RADIANS(AA99))","v":-0.63821430903952348},{"$f":"COS(RADIANS(Sight3!HC3_))*SIN(RADIANS(AA99))","v":-0.15912469905876478}]
[196,-0.96126169593831889,-0.275637355816999,null,-106,{"$f":"COS(RADIANS(E100))*COS(RADIANS(Sight3!LHA3_))","v":-0.26214718520048458},-0.96126169593831889,{"$f":"F100*COS(RADIANS(90-Sight3!LAT3_))-G100*SIN(RADIANS(90-Sight3!LAT3_))","v":0.46385658595540891},{"$f":"F100*SIN(RADIANS(90-Sight3!LAT3_))+G100*COS(RADIANS(90-Sight3!LAT3_))","v":-0.88180624995094159},null,{"$f":"COS(RADIANS(E100))*COS(RADIANS(Sight3!AZ_nord3-180))","v":-0.24413646900508534},null,305,0.8191520442889918,0.57357643635104605,null,null,null,null,196,{"$f":"COS(RADIANS(Sight3!DEC3_))*COS(RADIANS(T100))","v":-0.94986037346225649},{"$f":"COS(RADIANS(Sight3!DEC3_))*SIN(RADIANS(T100))","v":-0.27236807920543993},null,null,null,null,196,{"$f":"COS(RADIANS(Sight3!HC3_))*COS(RADIANS(AA100))","v":-0.63227215421634231},{"$f":"COS(RADIANS(Sight3!HC3_))*SIN(RADIANS(AA100))","v":-0.18130112276531746}]
[198,-0.95105651629515364,-0.30901699437494728,null,-108,{"$f":"COS(RADIANS(E101))*COS(RADIANS(Sight3!LHA3_))","v":-0.29389316631048057},-0.95105651629515364,{"$f":"F101*COS(RADIANS(90-Sight3!LAT3_))-G101*SIN(RADIANS(90-Sight3!LAT3_))","v":0.43367912937829917},{"$f":"F101*SIN(RADIANS(90-Sight3!LAT3_))+G101*COS(RADIANS(90-Sight3!LAT3_))","v":-0.89599336109881644},null,{"$f":"COS(RADIANS(E101))*COS(RADIANS(Sight3!AZ_nord3-180))","v":-0.27370135533933787},null,310,0.76604444311897812,0.64278760968653914,null,null,null,null,198,{"$f":"COS(RADIANS(Sight3!DEC3_))*COS(RADIANS(T101))","v":-0.93977623530501486},{"$f":"COS(RADIANS(Sight3!DEC3_))*SIN(RADIANS(T101))","v":-0.30535180890220959},null,null,null,null,198,{"$f":"COS(RADIANS(Sight3!HC3_))*COS(RADIANS(AA101))","v":-0.62555967316730765},{"$f":"COS(RADIANS(Sight3!HC3_))*SIN(RADIANS(AA101))","v":-0.20325665898107767}]
[200,-0.93969262078590843,-0.34202014332566866,null,-110,{"$f":"COS(RADIANS(E102))*COS(RADIANS(Sight3!LHA3_))","v":-0.32528108386809912},-0.93969262078590843,{"$f":"F102*COS(RADIANS(90-Sight3!LAT3_))-G102*SIN(RADIANS(90-Sight3!LAT3_))","v":0.40297330158519068},{"$f":"F102*SIN(RADIANS(90-Sight3!LAT3_))+G102*COS(RADIANS(90-Sight3!LAT3_))","v":-0.90908884235338927},null,{"$f":"COS(RADIANS(E102))*COS(RADIANS(Sight3!AZ_nord3-180))","v":-0.30293277873257118},null,315,0.70710678118654768,0.70710678118654735,null,null,null,null,200,{"$f":"COS(RADIANS(Sight3!DEC3_))*COS(RADIANS(T102))","v":-0.92854712456648569},{"$f":"COS(RADIANS(Sight3!DEC3_))*SIN(RADIANS(T102))","v":-0.3379635144556723},null,null,null,null,200,{"$f":"COS(RADIANS(Sight3!HC3_))*COS(RADIANS(AA102))","v":-0.61808504401659936},{"$f":"COS(RADIANS(Sight3!HC3_))*SIN(RADIANS(AA102))","v":-0.22496455826715761}]
[202,-0.92718385456678742,-0.37460659341591201,null,-112,{"$f":"COS(RADIANS(E103))*COS(RADIANS(Sight3!LHA3_))","v":-0.35627269653073423},-0.92718385456678742,{"$f":"F103*COS(RADIANS(90-Sight3!LAT3_))-G103*SIN(RADIANS(90-Sight3!LAT3_))","v":0.37177651289737929},{"$f":"F103*SIN(RADIANS(90-Sight3!LAT3_))+G103*COS(RADIANS(90-Sight3!LAT3_))","v":-0.92107673888795549},null,{"$f":"COS(RADIANS(E103))*COS(RADIANS(Sight3!AZ_nord3-180))","v":-0.33179512519813625},null,320,0.64278760968653958,0.76604444311897779,null,null,null,null,202,{"$f":"COS(RADIANS(Sight3!DEC3_))*COS(RADIANS(T103))","v":-0.91618672218839203},{"$f":"COS(RADIANS(Sight3!DEC3_))*SIN(RADIANS(T103))","v":-0.37016346352605933},null,null,null,null,202,{"$f":"COS(RADIANS(Sight3!HC3_))*COS(RADIANS(AA103))","v":-0.60985737344845914},{"$f":"COS(RADIANS(Sight3!HC3_))*SIN(RADIANS(AA103))","v":-0.24639837289212271}]
[204,-0.91354545764260087,-0.40673664307580021,null,-114,{"$f":"COS(RADIANS(E104))*COS(RADIANS(Sight3!LHA3_))","v":-0.38683024579224851},-0.91354545764260087,{"$f":"F104*COS(RADIANS(90-Sight3!LAT3_))-G104*SIN(RADIANS(90-Sight3!LAT3_))","v":0.34012677179638401},{"$f":"F104*SIN(RADIANS(90-Sight3!LAT3_))+G104*COS(RADIANS(90-Sight3!LAT3_))","v":-0.93194244529718195},null,{"$f":"COS(RADIANS(E104))*COS(RADIANS(Sight3!AZ_nord3-180))","v":-0.36025323041276835},null,325,{"$f":"COS(RADIANS(90+M104))","v":0.57357643635104649},{"$f":"SIN(RADIANS(90+M104))","v":0.81915204428899147},null,null,null,null,204,{"$f":"COS(RADIANS(Sight3!DEC3_))*COS(RADIANS(T104))","v":-0.90271008741705761},{"$f":"COS(RADIANS(Sight3!DEC3_))*SIN(RADIANS(T104))","v":-0.4019124254354503},null,null,null,null,204,{"$f":"COS(RADIANS(Sight3!HC3_))*COS(RADIANS(AA104))","v":-0.60088668561209879},{"$f":"COS(RADIANS(Sight3!HC3_))*SIN(RADIANS(AA104))","v":-0.26753198905447845}]
[206,-0.89879404629916693,-0.43837114678907746,null,-116,{"$f":"COS(RADIANS(E105))*COS(RADIANS(Sight3!LHA3_))","v":-0.41691650198589636},-0.89879404629916693,{"$f":"F105*COS(RADIANS(90-Sight3!LAT3_))-G105*SIN(RADIANS(90-Sight3!LAT3_))","v":0.30806263861646765},{"$f":"F105*SIN(RADIANS(90-Sight3!LAT3_))+G105*COS(RADIANS(90-Sight3!LAT3_))","v":-0.94167272339154251},null,{"$f":"COS(RADIANS(E105))*COS(RADIANS(Sight3!AZ_nord3-180))","v":-0.3882724225588986},null,{"$f":"SUM(M104+5)","v":330},0.49999999999999972,0.86602540378443882,null,null,null,null,206,{"$f":"COS(RADIANS(Sight3!DEC3_))*COS(RADIANS(T105))","v":-0.88813363945603463},{"$f":"COS(RADIANS(Sight3!DEC3_))*SIN(RADIANS(T105))","v":-0.43317171896431134},null,null,null,null,206,{"$f":"COS(RADIANS(Sight3!HC3_))*COS(RADIANS(AA105))","v":-0.59118390990881853},{"$f":"COS(RADIANS(Sight3!HC3_))*SIN(RADIANS(AA105))","v":-0.28833965869831513}]
[208,-0.88294759285892688,-0.46947156278589086,null,-118,{"$f":"COS(RADIANS(E106))*COS(RADIANS(Sight3!LHA3_))","v":-0.44649480964293836},-0.88294759285892688,{"$f":"F106*COS(RADIANS(90-Sight3!LAT3_))-G106*SIN(RADIANS(90-Sight3!LAT3_))","v":0.27562317856480889},{"$f":"F106*SIN(RADIANS(90-Sight3!LAT3_))+G106*COS(RADIANS(90-Sight3!LAT3_))","v":-0.95025571832601385},null,{"$f":"COS(RADIANS(E106))*COS(RADIANS(Sight3!AZ_nord3-180))","v":-0.41581856456692262},null,335,0.42261826174069927,0.90630778703665005,null,null,null,null,208,{"$f":"COS(RADIANS(Sight3!DEC3_))*COS(RADIANS(T106))","v":-0.87247513746183425},{"$f":"COS(RADIANS(Sight3!DEC3_))*SIN(RADIANS(T106))","v":-0.4639032594786025},null,null,null,null,208,{"$f":"COS(RADIANS(Sight3!HC3_))*COS(RADIANS(AA106))","v":-0.5807608676762146},{"$f":"COS(RADIANS(Sight3!HC3_))*SIN(RADIANS(AA106))","v":-0.30879603088334739}]
[210,-0.8660254037844386,-0.50000000000000011,null,-120,{"$f":"COS(RADIANS(E107))*COS(RADIANS(Sight3!LHA3_))","v":-0.47552913215168302},-0.86602540378443871,{"$f":"F107*COS(RADIANS(90-Sight3!LAT3_))-G107*SIN(RADIANS(90-Sight3!LAT3_))","v":0.24284791412656515},{"$f":"F107*SIN(RADIANS(90-Sight3!LAT3_))+G107*COS(RADIANS(90-Sight3!LAT3_))","v":-0.95768097304337685},null,{"$f":"COS(RADIANS(E107))*COS(RADIANS(Sight3!AZ_nord3-180))","v":-0.44285809570596107},null,340,0.34202014332566866,0.93969262078590843,null,null,null,null,210,{"$f":"COS(RADIANS(Sight3!DEC3_))*COS(RADIANS(T107))","v":-0.85575365890712873},{"$f":"COS(RADIANS(Sight3!DEC3_))*SIN(RADIANS(T107))","v":-0.49406960533003813},null,null,null,null,210,{"$f":"COS(RADIANS(Sight3!HC3_))*COS(RADIANS(AA107))","v":-0.56963025778570098},{"$f":"COS(RADIANS(Sight3!HC3_))*SIN(RADIANS(AA107))","v":-0.32887618267113045}]
[212,-0.84804809615642607,-0.52991926423320479,null,-122,{"$f":"COS(RADIANS(E108))*COS(RADIANS(Sight3!LHA3_))","v":-0.50398409566254876},-0.84804809615642607,{"$f":"F108*COS(RADIANS(90-Sight3!LAT3_))-G108*SIN(RADIANS(90-Sight3!LAT3_))","v":0.20977677691281149},{"$f":"F108*SIN(RADIANS(90-Sight3!LAT3_))+G108*COS(RADIANS(90-Sight3!LAT3_))","v":-0.96393944101453188},null,{"$f":"COS(RADIANS(E108))*COS(RADIANS(Sight3!AZ_nord3-180))","v":-0.46935807247244238},null,345,0.25881904510252074,0.96592582628906831,null,null,null,null,212,{"$f":"COS(RADIANS(Sight3!DEC3_))*COS(RADIANS(T108))","v":-0.83798957633779114},{"$f":"COS(RADIANS(Sight3!DEC3_))*SIN(RADIANS(T108))","v":-0.52363400347296729},null,null,null,null,212,{"$f":"COS(RADIANS(Sight3!HC3_))*COS(RADIANS(AA108))","v":-0.55780564117089027},{"$f":"COS(RADIANS(Sight3!HC3_))*SIN(RADIANS(AA108))","v":-0.34855564948982093}]
[214,-0.82903757255504185,-0.55919290347074668,null,-124,{"$f":"COS(RADIANS(E109))*COS(RADIANS(Sight3!LHA3_))","v":-0.53182503218564825},-0.82903757255504174,{"$f":"F109*COS(RADIANS(90-Sight3!LAT3_))-G109*SIN(RADIANS(90-Sight3!LAT3_))","v":0.17645005901002475},{"$f":"F109*SIN(RADIANS(90-Sight3!LAT3_))+G109*COS(RADIANS(90-Sight3!LAT3_))","v":-0.96902349726029902},null,{"$f":"COS(RADIANS(E109))*COS(RADIANS(Sight3!AZ_nord3-180))","v":-0.49528620872668461},null,350,0.17364817766693044,0.98480775301220802,null,null,null,null,214,{"$f":"COS(RADIANS(Sight3!DEC3_))*COS(RADIANS(T109))","v":-0.81920453255208459},{"$f":"COS(RADIANS(Sight3!DEC3_))*SIN(RADIANS(T109))","v":-0.55256043424229973},null,null,null,null,214,{"$f":"COS(RADIANS(Sight3!HC3_))*COS(RADIANS(AA109))","v":-0.54530142430568496},{"$f":"COS(RADIANS(Sight3!HC3_))*SIN(RADIANS(AA109))","v":-0.36781045494049014}]
[216,-0.80901699437494756,-0.58778525229247303,null,-126,{"$f":"COS(RADIANS(E110))*COS(RADIANS(Sight3!LHA3_))","v":-0.55901802182839577},-0.80901699437494745,{"$f":"F110*COS(RADIANS(90-Sight3!LAT3_))-G110*SIN(RADIANS(90-Sight3!LAT3_))","v":0.14290836389038225},{"$f":"F110*SIN(RADIANS(90-Sight3!LAT3_))+G110*COS(RADIANS(90-Sight3!LAT3_))","v":-0.9729269476412814},null,{"$f":"COS(RADIANS(E110))*COS(RADIANS(Sight3!AZ_nord3-180))","v":-0.52061091502858525},null,355,8.7155742747658374E-2,0.99619469809174555,null,null,null,null,216,{"$f":"COS(RADIANS(Sight3!DEC3_))*COS(RADIANS(T110))","v":-0.79942141423224788},{"$f":"COS(RADIANS(Sight3!DEC3_))*SIN(RADIANS(T110))","v":-0.58081365523791795},null,null,null,null,216,{"$f":"COS(RADIANS(Sight3!HC3_))*COS(RADIANS(AA110))","v":-0.5321328416522082},{"$f":"COS(RADIANS(Sight3!HC3_))*SIN(RADIANS(AA110))","v":-0.38661714000867164}]
[218,-0.78801075360672201,-0.61566147532565818,null,-128,{"$f":"COS(RADIANS(E111))*COS(RADIANS(Sight3!LHA3_))","v":-0.58552993412167043},-0.78801075360672201,{"$f":"F111*COS(RADIANS(90-Sight3!LAT3_))-G111*SIN(RADIANS(90-Sight3!LAT3_))","v":0.10919255694268526},{"$f":"F111*SIN(RADIANS(90-Sight3!LAT3_))+G111*COS(RADIANS(90-Sight3!LAT3_))","v":-0.9756450364044702},null,{"$f":"COS(RADIANS(E111))*COS(RADIANS(Sight3!AZ_nord3-180))","v":-0.54530133712448747},null,null,null,null,null,null,null,null,218,{"$f":"COS(RADIANS(Sight3!DEC3_))*COS(RADIANS(T111))","v":-0.77866432406059793},{"$f":"COS(RADIANS(Sight3!DEC3_))*SIN(RADIANS(T111))","v":-0.60835924426211374},null,null,null,null,218,{"$f":"COS(RADIANS(Sight3!HC3_))*COS(RADIANS(AA111))","v":-0.51831593709995882},{"$f":"COS(RADIANS(Sight3!HC3_))*SIN(RADIANS(AA111))","v":-0.40495279164555759}]
[220,-0.76604444311897801,-0.64278760968653925,null,-130,{"$f":"COS(RADIANS(E112))*COS(RADIANS(Sight3!LHA3_))","v":-0.61132846838418997},-0.76604444311897801,{"$f":"F112*COS(RADIANS(90-Sight3!LAT3_))-G112*SIN(RADIANS(90-Sight3!LAT3_))","v":7.5343715684177581E-2},{"$f":"F112*SIN(RADIANS(90-Sight3!LAT3_))+G112*COS(RADIANS(90-Sight3!LAT3_))","v":-0.97717445197739727},null,{"$f":"COS(RADIANS(E112))*COS(RADIANS(Sight3!AZ_nord3-180))","v":-0.56932739353833506},null,null,null,null,null,null,null,null,220,{"$f":"COS(RADIANS(Sight3!DEC3_))*COS(RADIANS(T112))","v":-0.75695855135412449},{"$f":"COS(RADIANS(Sight3!DEC3_))*SIN(RADIANS(T112))","v":-0.63516364125773395},null,null,null,null,220,{"$f":"COS(RADIANS(Sight3!HC3_))*COS(RADIANS(AA112))","v":-0.50386754441880277},{"$f":"COS(RADIANS(Sight3!HC3_))*SIN(RADIANS(AA112))","v":-0.42279507068401911}]
[222,-0.74314482547739424,-0.66913060635885824,null,-132,{"$f":"COS(RADIANS(E113))*COS(RADIANS(Sight3!LHA3_))","v":-0.63638219307591493},-0.74314482547739424,{"$f":"F113*COS(RADIANS(90-Sight3!LAT3_))-G113*SIN(RADIANS(90-Sight3!LAT3_))","v":4.1403079713918489E-2},{"$f":"F113*SIN(RADIANS(90-Sight3!LAT3_))+G113*COS(RADIANS(90-Sight3!LAT3_))","v":-0.97751333100277493},null,{"$f":"COS(RADIANS(E113))*COS(RADIANS(Sight3!AZ_nord3-180))","v":-0.59265981222131836},null,null,null,null,null,null,null,null,222,{"$f":"COS(RADIANS(Sight3!DEC3_))*COS(RADIANS(T113))","v":-0.73433054125335229},{"$f":"COS(RADIANS(Sight3!DEC3_))*SIN(RADIANS(T113))","v":-0.6611941891959402},null,null,null,null,222,{"$f":"COS(RADIANS(Sight3!HC3_))*COS(RADIANS(AA113))","v":-0.48880526674961766},{"$f":"COS(RADIANS(Sight3!HC3_))*SIN(RADIANS(AA113))","v":-0.44012223905544023}]
[224,-0.71933980033865108,-0.69465837045899737,null,-134,{"$f":"COS(RADIANS(E114))*COS(RADIANS(Sight3!LHA3_))","v":-0.66066058409253903},-0.71933980033865108,{"$f":"F114*COS(RADIANS(90-Sight3!LAT3_))-G114*SIN(RADIANS(90-Sight3!LAT3_))","v":7.4120004686834551E-3},{"$f":"F114*SIN(RADIANS(90-Sight3!LAT3_))+G114*COS(RADIANS(90-Sight3!LAT3_))","v":-0.9766612606087115},null,{"$f":"COS(RADIANS(E114))*COS(RADIANS(Sight3!AZ_nord3-180))","v":-0.61527016621535557},null,null,null,null,null,null,null,null,224,{"$f":"COS(RADIANS(Sight3!DEC3_))*COS(RADIANS(T114))","v":-0.71080786250301142},{"$f":"COS(RADIANS(Sight3!DEC3_))*SIN(RADIANS(T114))","v":-0.68641917386376838},null,null,null,null,224,{"$f":"COS(RADIANS(Sight3!HC3_))*COS(RADIANS(AA114))","v":-0.47314745515757733},{"$f":"COS(RADIANS(Sight3!HC3_))*SIN(RADIANS(AA114))","v":-0.45691318627420596}]
[226,-0.69465837045899725,-0.71933980033865119,null,-136,{"$f":"COS(RADIANS(E115))*COS(RADIANS(Sight3!LHA3_))","v":-0.68413406195440785},-0.69465837045899714,{"$f":"F115*COS(RADIANS(90-Sight3!LAT3_))-G115*SIN(RADIANS(90-Sight3!LAT3_))","v":-2.658810915739146E-2},{"$f":"F115*SIN(RADIANS(90-Sight3!LAT3_))+G115*COS(RADIANS(90-Sight3!LAT3_))","v":-0.9746192789117305},null,{"$f":"COS(RADIANS(E115))*COS(RADIANS(Sight3!AZ_nord3-180))","v":-0.63713090828696295},null,null,null,null,null,null,null,null,226,{"$f":"COS(RADIANS(Sight3!DEC3_))*COS(RADIANS(T115))","v":-0.68641917386376827},{"$f":"COS(RADIANS(Sight3!DEC3_))*SIN(RADIANS(T115))","v":-0.71080786250301153},null,null,null,null,226,{"$f":"COS(RADIANS(Sight3!HC3_))*COS(RADIANS(AA115))","v":-0.45691318627420591},{"$f":"COS(RADIANS(Sight3!HC3_))*SIN(RADIANS(AA115))","v":-0.47314745515757745}]
[228,-0.66913060635885813,-0.74314482547739436,null,-138,{"$f":"COS(RADIANS(E116))*COS(RADIANS(Sight3!LHA3_))","v":-0.70677402784455856},-0.66913060635885835,{"$f":"F116*COS(RADIANS(90-Sight3!LAT3_))-G116*SIN(RADIANS(90-Sight3!LAT3_))","v":-6.0555825268041985E-2},{"$f":"F116*SIN(RADIANS(90-Sight3!LAT3_))+G116*COS(RADIANS(90-Sight3!LAT3_))","v":-0.9713898737519866},null,{"$f":"COS(RADIANS(E116))*COS(RADIANS(Sight3!AZ_nord3-180))","v":-0.65821540448931537},null,null,null,null,null,null,null,null,228,{"$f":"COS(RADIANS(Sight3!DEC3_))*COS(RADIANS(T116))","v":-0.66119418919594009},{"$f":"COS(RADIANS(Sight3!DEC3_))*SIN(RADIANS(T116))","v":-0.7343305412533524},null,null,null,null,228,{"$f":"COS(RADIANS(Sight3!HC3_))*COS(RADIANS(AA116))","v":-0.44012223905544012},{"$f":"COS(RADIANS(Sight3!HC3_))*SIN(RADIANS(AA116))","v":-0.48880526674961772}]
[230,-0.64278760968653947,-0.7660444431189779,null,-140,{"$f":"COS(RADIANS(E117))*COS(RADIANS(Sight3!LHA3_))","v":-0.72855289845197413},-0.64278760968653947,{"$f":"F117*COS(RADIANS(90-Sight3!LAT3_))-G117*SIN(RADIANS(90-Sight3!LAT3_))","v":-9.4449763433513634E-2},{"$f":"F117*SIN(RADIANS(90-Sight3!LAT3_))+G117*COS(RADIANS(90-Sight3!LAT3_))","v":-0.96697697966221552},null,{"$f":"COS(RADIANS(E117))*COS(RADIANS(Sight3!AZ_nord3-180))","v":-0.67849796661160833},null,null,null,null,null,null,null,null,230,{"$f":"COS(RADIANS(Sight3!DEC3_))*COS(RADIANS(T117))","v":-0.63516364125773417},{"$f":"COS(RADIANS(Sight3!DEC3_))*SIN(RADIANS(T117))","v":-0.75695855135412438},null,null,null,null,230,{"$f":"COS(RADIANS(Sight3!HC3_))*COS(RADIANS(AA117))","v":-0.42279507068401923},{"$f":"COS(RADIANS(Sight3!HC3_))*SIN(RADIANS(AA117))","v":-0.50386754441880266}]
[232,-0.61566147532565807,-0.78801075360672213,null,-142,{"$f":"COS(RADIANS(E118))*COS(RADIANS(Sight3!LHA3_))","v":-0.7494441395775967},-0.6156614753256584,{"$f":"F118*COS(RADIANS(90-Sight3!LAT3_))-G118*SIN(RADIANS(90-Sight3!LAT3_))","v":-0.12822862911111221},{"$f":"F118*SIN(RADIANS(90-Sight3!LAT3_))+G118*COS(RADIANS(90-Sight3!LAT3_))","v":-0.961385973074111},null,{"$f":"COS(RADIANS(E118))*COS(RADIANS(Sight3!AZ_nord3-180))","v":-0.6979538834761847},null,null,null,null,null,null,null,null,232,{"$f":"COS(RADIANS(Sight3!DEC3_))*COS(RADIANS(T118))","v":-0.60835924426211363},{"$f":"COS(RADIANS(Sight3!DEC3_))*SIN(RADIANS(T118))","v":-0.77866432406059805},null,null,null,null,232,{"$f":"COS(RADIANS(Sight3!HC3_))*COS(RADIANS(AA118))","v":-0.40495279164555753},{"$f":"COS(RADIANS(Sight3!HC3_))*SIN(RADIANS(AA118))","v":-0.51831593709995893}]
[234,-0.58778525229247325,-0.80901699437494734,null,-144,{"$f":"COS(RADIANS(E119))*COS(RADIANS(Sight3!LHA3_))","v":-0.76942229846216381},-0.58778525229247325,{"$f":"F119*COS(RADIANS(90-Sight3!LAT3_))-G119*SIN(RADIANS(90-Sight3!LAT3_))","v":-0.16185126795624499},{"$f":"F119*SIN(RADIANS(90-Sight3!LAT3_))+G119*COS(RADIANS(90-Sight3!LAT3_))","v":-0.95462366576797231},null,{"$f":"COS(RADIANS(E119))*COS(RADIANS(Sight3!AZ_nord3-180))","v":-0.71655945104529917},null,null,null,null,null,null,null,null,234,{"$f":"COS(RADIANS(Sight3!DEC3_))*COS(RADIANS(T119))","v":-0.58081365523791817},{"$f":"COS(RADIANS(Sight3!DEC3_))*SIN(RADIANS(T119))","v":-0.79942141423224766},null,null,null,null,234,{"$f":"COS(RADIANS(Sight3!HC3_))*COS(RADIANS(AA119))","v":-0.38661714000867181},{"$f":"COS(RADIANS(Sight3!HC3_))*SIN(RADIANS(AA119))","v":-0.53213284165220809}]
[236,-0.55919290347074657,-0.82903757255504185,null,-146,{"$f":"COS(RADIANS(E120))*COS(RADIANS(Sight3!LHA3_))","v":-0.78846303479647417},-0.5591929034707469,{"$f":"F120*COS(RADIANS(90-Sight3!LAT3_))-G120*SIN(RADIANS(90-Sight3!LAT3_))","v":-0.19527671596264978},{"$f":"F120*SIN(RADIANS(90-Sight3!LAT3_))+G120*COS(RADIANS(90-Sight3!LAT3_))","v":-0.94669829657359827},null,{"$f":"COS(RADIANS(E120))*COS(RADIANS(Sight3!AZ_nord3-180))","v":-0.73429200130083694},null,null,null,null,null,null,null,null,236,{"$f":"COS(RADIANS(Sight3!DEC3_))*COS(RADIANS(T120))","v":-0.55256043424229961},{"$f":"COS(RADIANS(Sight3!DEC3_))*SIN(RADIANS(T120))","v":-0.81920453255208459},null,null,null,null,236,{"$f":"COS(RADIANS(Sight3!HC3_))*COS(RADIANS(AA120))","v":-0.36781045494049008},{"$f":"COS(RADIANS(Sight3!HC3_))*SIN(RADIANS(AA120))","v":-0.54530142430568496}]
[238,-0.52991926423320501,-0.84804809615642596,null,-148,{"$f":"COS(RADIANS(E121))*COS(RADIANS(Sight3!LHA3_))","v":-0.80654315037630486},-0.5299192642332049,{"$f":"F121*COS(RADIANS(90-Sight3!LAT3_))-G121*SIN(RADIANS(90-Sight3!LAT3_))","v":-0.22846424937072624},{"$f":"F121*SIN(RADIANS(90-Sight3!LAT3_))+G121*COS(RADIANS(90-Sight3!LAT3_))","v":-0.93761952133254267},null,{"$f":"COS(RADIANS(E121))*COS(RADIANS(Sight3!AZ_nord3-180))","v":-0.75112992986180149},null,null,null,null,null,null,null,null,238,{"$f":"COS(RADIANS(Sight3!DEC3_))*COS(RADIANS(T121))","v":-0.52363400347296751},{"$f":"COS(RADIANS(Sight3!DEC3_))*SIN(RADIANS(T121))","v":-0.83798957633779103},null,null,null,null,238,{"$f":"COS(RADIANS(Sight3!HC3_))*COS(RADIANS(AA121))","v":-0.3485556494898211},{"$f":"COS(RADIANS(Sight3!HC3_))*SIN(RADIANS(AA121))","v":-0.55780564117089015}]
[240,-0.50000000000000044,-0.86602540378443837,null,-150,{"$f":"COS(RADIANS(E122))*COS(RADIANS(Sight3!LHA3_))","v":-0.82364061736585037},-0.49999999999999994,{"$f":"F122*COS(RADIANS(90-Sight3!LAT3_))-G122*SIN(RADIANS(90-Sight3!LAT3_))","v":-0.26137343428316429},{"$f":"F122*SIN(RADIANS(90-Sight3!LAT3_))+G122*COS(RADIANS(90-Sight3!LAT3_))","v":-0.92739840113395888},null,{"$f":"COS(RADIANS(E122))*COS(RADIANS(Sight3!AZ_nord3-180))","v":-0.76705272230592547},null,null,null,null,null,null,null,null,240,{"$f":"COS(RADIANS(Sight3!DEC3_))*COS(RADIANS(T122))","v":-0.49406960533003846},{"$f":"COS(RADIANS(Sight3!DEC3_))*SIN(RADIANS(T122))","v":-0.85575365890712851},null,null,null,null,240,{"$f":"COS(RADIANS(Sight3!HC3_))*COS(RADIANS(AA122))","v":-0.32887618267113067},{"$f":"COS(RADIANS(Sight3!HC3_))*SIN(RADIANS(AA122))","v":-0.56963025778570087}]
[242,-0.46947156278589075,-0.88294759285892699,null,-152,{"$f":"COS(RADIANS(E123))*COS(RADIANS(Sight3!LHA3_))","v":-0.83973460513524656},-0.46947156278589069,{"$f":"F123*COS(RADIANS(90-Sight3!LAT3_))-G123*SIN(RADIANS(90-Sight3!LAT3_))","v":-0.2939641759274193},{"$f":"F123*SIN(RADIANS(90-Sight3!LAT3_))+G123*COS(RADIANS(90-Sight3!LAT3_))","v":-0.91604738883836578},null,{"$f":"COS(RADIANS(E123))*COS(RADIANS(Sight3!AZ_nord3-180))","v":-0.7820409791633337},null,null,null,null,null,null,null,null,242,{"$f":"COS(RADIANS(Sight3!DEC3_))*COS(RADIANS(T123))","v":-0.46390325947860239},{"$f":"COS(RADIANS(Sight3!DEC3_))*SIN(RADIANS(T123))","v":-0.87247513746183436},null,null,null,null,242,{"$f":"COS(RADIANS(Sight3!HC3_))*COS(RADIANS(AA123))","v":-0.30879603088334734},{"$f":"COS(RADIANS(Sight3!HC3_))*SIN(RADIANS(AA123))","v":-0.58076086767621471}]
[244,-0.43837114678907774,-0.89879404629916682,null,-154,{"$f":"COS(RADIANS(E124))*COS(RADIANS(Sight3!LHA3_))","v":-0.85480550563948543},-0.43837114678907729,{"$f":"F124*COS(RADIANS(90-Sight3!LAT3_))-G124*SIN(RADIANS(90-Sight3!LAT3_))","v":-0.3261967675050168},{"$f":"F124*SIN(RADIANS(90-Sight3!LAT3_))+G124*COS(RADIANS(90-Sight3!LAT3_))","v":-0.90358031390575633},null,{"$f":"COS(RADIANS(E124))*COS(RADIANS(Sight3!AZ_nord3-180))","v":-0.7960764395518094},null,null,null,null,null,null,null,null,244,{"$f":"COS(RADIANS(Sight3!DEC3_))*COS(RADIANS(T124))","v":-0.43317171896431161},{"$f":"COS(RADIANS(Sight3!DEC3_))*SIN(RADIANS(T124))","v":-0.88813363945603452},null,null,null,null,244,{"$f":"COS(RADIANS(Sight3!HC3_))*COS(RADIANS(AA124))","v":-0.28833965869831529},{"$f":"COS(RADIANS(Sight3!HC3_))*SIN(RADIANS(AA124))","v":-0.59118390990881842}]
[246,-0.4067366430758001,-0.91354545764260098,null,-156,{"$f":"COS(RADIANS(E125))*COS(RADIANS(Sight3!LHA3_))","v":-0.86883495730779647},-0.40673664307580043,{"$f":"F125*COS(RADIANS(90-Sight3!LAT3_))-G125*SIN(RADIANS(90-Sight3!LAT3_))","v":-0.35803193856816917},{"$f":"F125*SIN(RADIANS(90-Sight3!LAT3_))+G125*COS(RADIANS(90-Sight3!LAT3_))","v":-0.89001236554653007},null,{"$f":"COS(RADIANS(E125))*COS(RADIANS(Sight3!AZ_nord3-180))","v":-0.8091420034248662},null,null,null,null,null,null,null,null,246,{"$f":"COS(RADIANS(Sight3!DEC3_))*COS(RADIANS(T125))","v":-0.40191242543545019},{"$f":"COS(RADIANS(Sight3!DEC3_))*SIN(RADIANS(T125))","v":-0.90271008741705761},null,null,null,null,246,{"$f":"COS(RADIANS(Sight3!HC3_))*COS(RADIANS(AA125))","v":-0.26753198905447839},{"$f":"COS(RADIANS(Sight3!HC3_))*SIN(RADIANS(AA125))","v":-0.6008866856120989}]
[248,-0.37460659341591229,-0.92718385456678731,null,-158,{"$f":"COS(RADIANS(E126))*COS(RADIANS(Sight3!LHA3_))","v":-0.88180586741439371},-0.37460659341591224,{"$f":"F126*COS(RADIANS(90-Sight3!LAT3_))-G126*SIN(RADIANS(90-Sight3!LAT3_))","v":-0.389430902864769},{"$f":"F126*SIN(RADIANS(90-Sight3!LAT3_))+G126*COS(RADIANS(90-Sight3!LAT3_))","v":-0.87536007421578044},null,{"$f":"COS(RADIANS(E126))*COS(RADIANS(Sight3!AZ_nord3-180))","v":-0.82122175240552076},null,null,null,null,null,null,null,null,248,{"$f":"COS(RADIANS(Sight3!DEC3_))*COS(RADIANS(T126))","v":-0.37016346352605961},{"$f":"COS(RADIANS(Sight3!DEC3_))*SIN(RADIANS(T126))","v":-0.91618672218839192},null,null,null,null,248,{"$f":"COS(RADIANS(Sight3!HC3_))*COS(RADIANS(AA126))","v":-0.24639837289212288},{"$f":"COS(RADIANS(Sight3!HC3_))*SIN(RADIANS(AA126))","v":-0.60985737344845903}]
[250,-0.34202014332566855,-0.93969262078590843,null,-160,{"$f":"COS(RADIANS(E127))*COS(RADIANS(Sight3!LHA3_))","v":-0.89370243290332751},-0.34202014332566888,{"$f":"F127*COS(RADIANS(90-Sight3!LAT3_))-G127*SIN(RADIANS(90-Sight3!LAT3_))","v":-0.42035540559346007},{"$f":"F127*SIN(RADIANS(90-Sight3!LAT3_))+G127*COS(RADIANS(90-Sight3!LAT3_))","v":-0.85964129147348167},null,{"$f":"COS(RADIANS(E127))*COS(RADIANS(Sight3!AZ_nord3-180))","v":-0.83230096918038277},null,null,null,null,null,null,null,null,250,{"$f":"COS(RADIANS(Sight3!DEC3_))*COS(RADIANS(T127))","v":-0.33796351445567219},{"$f":"COS(RADIANS(Sight3!DEC3_))*SIN(RADIANS(T127))","v":-0.92854712456648569},null,null,null,null,250,{"$f":"COS(RADIANS(Sight3!HC3_))*COS(RADIANS(AA127))","v":-0.22496455826715753},{"$f":"COS(RADIANS(Sight3!HC3_))*SIN(RADIANS(AA127))","v":-0.61808504401659936}]
[252,-0.30901699437494756,-0.95105651629515353,null,-162,{"$f":"COS(RADIANS(E128))*COS(RADIANS(Sight3!LHA3_))","v":-0.90451015964207515},-0.30901699437494751,{"$f":"F128*COS(RADIANS(90-Sight3!LAT3_))-G128*SIN(RADIANS(90-Sight3!LAT3_))","v":-0.45076777001122192},{"$f":"F128*SIN(RADIANS(90-Sight3!LAT3_))+G128*COS(RADIANS(90-Sight3!LAT3_))","v":-0.84287516823511222},null,{"$f":"COS(RADIANS(E128))*COS(RADIANS(Sight3!AZ_nord3-180))","v":-0.84236615543043447},null,null,null,null,null,null,null,null,252,{"$f":"COS(RADIANS(Sight3!DEC3_))*COS(RADIANS(T128))","v":-0.30535180890220986},{"$f":"COS(RADIANS(Sight3!DEC3_))*SIN(RADIANS(T128))","v":-0.93977623530501475},null,null,null,null,252,{"$f":"COS(RADIANS(Sight3!HC3_))*COS(RADIANS(AA128))","v":-0.20325665898107786},{"$f":"COS(RADIANS(Sight3!HC3_))*SIN(RADIANS(AA128))","v":-0.62555967316730765}]
[254,-0.27563735581699889,-0.96126169593831901,null,-164,{"$f":"COS(RADIANS(E129))*COS(RADIANS(Sight3!LHA3_))","v":-0.91421588008040799},-0.27563735581699922,{"$f":"F129*COS(RADIANS(90-Sight3!LAT3_))-G129*SIN(RADIANS(90-Sight3!LAT3_))","v":-0.48063094333667711},{"$f":"F129*SIN(RADIANS(90-Sight3!LAT3_))+G129*COS(RADIANS(90-Sight3!LAT3_))","v":-0.82508213143921483},null,{"$f":"COS(RADIANS(E129))*COS(RADIANS(Sight3!AZ_nord3-180))","v":-0.85140504827665342},null,null,null,null,null,null,null,null,254,{"$f":"COS(RADIANS(Sight3!DEC3_))*COS(RADIANS(T129))","v":-0.27236807920543982},{"$f":"COS(RADIANS(Sight3!DEC3_))*SIN(RADIANS(T129))","v":-0.9498603734622566},null,null,null,null,254,{"$f":"COS(RADIANS(Sight3!HC3_))*COS(RADIANS(AA129))","v":-0.18130112276531737},{"$f":"COS(RADIANS(Sight3!HC3_))*SIN(RADIANS(AA129))","v":-0.63227215421634242}]
[256,{"$f":"COS(RADIANS(A130))","v":-0.24192189559966779},{"$f":"SIN(RADIANS(A130))","v":-0.97029572627599647},null,-166,{"$f":"COS(RADIANS(E130))*COS(RADIANS(Sight3!LHA3_))","v":-0.92280776929302355},-0.24192189559966773,{"$f":"F130*COS(RADIANS(90-Sight3!LAT3_))-G130*SIN(RADIANS(90-Sight3!LAT3_))","v":-0.5099085418931979},{"$f":"F130*SIN(RADIANS(90-Sight3!LAT3_))+G130*COS(RADIANS(90-Sight3!LAT3_))","v":-0.80628385916031797},null,{"$f":"COS(RADIANS(E130))*COS(RADIANS(Sight3!AZ_nord3-180))","v":-0.85940663522044092},null,null,null,null,null,null,null,null,256,{"$f":"COS(RADIANS(Sight3!DEC3_))*COS(RADIANS(T130))","v":-0.23905251095924504},{"$f":"COS(RADIANS(Sight3!DEC3_))*SIN(RADIANS(T130))","v":-0.95878725306920831},null,null,null,null,256,{"$f":"COS(RADIANS(Sight3!HC3_))*COS(RADIANS(AA130))","v":-0.15912469905876495},{"$f":"COS(RADIANS(Sight3!HC3_))*SIN(RADIANS(AA130))","v":-0.63821430903952348}]
[{"$f":"SUM(A130+2)","v":258},-0.20791169081775979,-0.97814760073380558,null,{"$f":"SUM(E130-2)","v":-168},{"$f":"COS(RADIANS(E131))*COS(RADIANS(Sight3!LHA3_))","v":-0.93027535938639561},{"$f":"SIN(RADIANS(E131))","v":-0.20791169081775931},{"$f":"F131*COS(RADIANS(90-Sight3!LAT3_))-G131*SIN(RADIANS(90-Sight3!LAT3_))","v":-0.53856489543681141},{"$f":"F131*SIN(RADIANS(90-Sight3!LAT3_))+G131*COS(RADIANS(90-Sight3!LAT3_))","v":-0.78650325419754208},null,{"$f":"COS(RADIANS(E131))*COS(RADIANS(Sight3!AZ_nord3-180))","v":-0.86636116756065629},null,null,null,null,null,null,null,null,258,{"$f":"COS(RADIANS(Sight3!DEC3_))*COS(RADIANS(T131))","v":-0.20544569405166294},{"$f":"COS(RADIANS(Sight3!DEC3_))*SIN(RADIANS(T131))","v":-0.96654599809814989},null,null,null,null,{"$f":"SUM(AA130+2)","v":258},{"$f":"COS(RADIANS(Sight3!HC3_))*COS(RADIANS(AA131))","v":-0.13675440641769029},{"$f":"COS(RADIANS(Sight3!HC3_))*SIN(RADIANS(AA131))","v":-0.64337889803651793}]
[260,-0.17364817766693033,-0.98480775301220802,null,-170,{"$f":"COS(RADIANS(E132))*COS(RADIANS(Sight3!LHA3_))","v":-0.93660955225228903},-0.17364817766693028,{"$f":"F132*COS(RADIANS(90-Sight3!LAT3_))-G132*SIN(RADIANS(90-Sight3!LAT3_))","v":-0.56656509061489768},{"$f":"F132*SIN(RADIANS(90-Sight3!LAT3_))+G132*COS(RADIANS(90-Sight3!LAT3_))","v":-0.76576441617106494},null,{"$f":"COS(RADIANS(E132))*COS(RADIANS(Sight3!AZ_nord3-180))","v":-0.87226017227090624},null,null,null,null,null,null,null,null,260,{"$f":"COS(RADIANS(Sight3!DEC3_))*COS(RADIANS(T132))","v":-0.17158857321236118},{"$f":"COS(RADIANS(Sight3!DEC3_))*SIN(RADIANS(T132))","v":-0.97312715571340636},null,null,null,null,260,{"$f":"COS(RADIANS(Sight3!HC3_))*COS(RADIANS(AA132))","v":-0.11421749959779656},{"$f":"COS(RADIANS(Sight3!HC3_))*SIN(RADIANS(AA132))","v":-0.64775962895117678}]
[262,-0.13917310096006583,-0.99026806874157025,null,-172,{"$f":"COS(RADIANS(E133))*COS(RADIANS(Sight3!LHA3_))","v":-0.94180263065240477},-0.13917310096006533,{"$f":"F133*COS(RADIANS(90-Sight3!LAT3_))-G133*SIN(RADIANS(90-Sight3!LAT3_))","v":-0.59387501350273153},{"$f":"F133*SIN(RADIANS(90-Sight3!LAT3_))+G133*COS(RADIANS(90-Sight3!LAT3_))","v":-0.74409261216044931},null,{"$f":"COS(RADIANS(E133))*COS(RADIANS(Sight3!AZ_nord3-180))","v":-0.87709646232262362},null,null,null,null,null,null,null,null,262,{"$f":"COS(RADIANS(Sight3!DEC3_))*COS(RADIANS(T133))","v":-0.13752239812779452},{"$f":"COS(RADIANS(Sight3!DEC3_))*SIN(RADIANS(T133))","v":-0.97852270778817318},null,null,null,null,262,{"$f":"COS(RADIANS(Sight3!HC3_))*COS(RADIANS(AA133))","v":-9.1541436348500566E-2},{"$f":"COS(RADIANS(Sight3!HC3_))*SIN(RADIANS(AA133))","v":-0.65135116453768038}]
[264,-0.10452846326765336,-0.9945218953682734,null,-174,{"$f":"COS(RADIANS(E134))*COS(RADIANS(Sight3!LHA3_))","v":-0.94584826762064422},-0.10452846326765373,{"$f":"F134*COS(RADIANS(90-Sight3!LAT3_))-G134*SIN(RADIANS(90-Sight3!LAT3_))","v":-0.62046139116604493},{"$f":"F134*SIN(RADIANS(90-Sight3!LAT3_))+G134*COS(RADIANS(90-Sight3!LAT3_))","v":-0.72151424592059654},null,{"$f":"COS(RADIANS(E134))*COS(RADIANS(Sight3!AZ_nord3-180))","v":-0.88086414544135361},null,null,null,null,null,null,null,null,264,{"$f":"COS(RADIANS(Sight3!DEC3_))*COS(RADIANS(T134))","v":-0.10328867318480975},{"$f":"COS(RADIANS(Sight3!DEC3_))*SIN(RADIANS(T134))","v":-0.98272608067336842},null,null,null,null,264,{"$f":"COS(RADIANS(Sight3!HC3_))*COS(RADIANS(AA134))","v":-6.875384395989062E-2},{"$f":"COS(RADIANS(Sight3!HC3_))*SIN(RADIANS(AA134))","v":-0.65414912906315026}]
[266,-6.975647374412558E-2,-0.9975640502598242,null,-176,{"$f":"COS(RADIANS(E135))*COS(RADIANS(Sight3!LHA3_))","v":-0.94874153417154461},-6.9756473744125524E-2,{"$f":"F135*COS(RADIANS(90-Sight3!LAT3_))-G135*SIN(RADIANS(90-Sight3!LAT3_))","v":-0.64629183219897346},{"$f":"F135*SIN(RADIANS(90-Sight3!LAT3_))+G135*COS(RADIANS(90-Sight3!LAT3_))","v":-0.698056825712839},null,{"$f":"COS(RADIANS(E135))*COS(RADIANS(Sight3!AZ_nord3-180))","v":-0.88355863128558321},null,null,null,null,null,null,null,null,266,{"$f":"COS(RADIANS(Sight3!DEC3_))*COS(RADIANS(T135))","v":-6.8929106903950571E-2},{"$f":"COS(RADIANS(Sight3!DEC3_))*SIN(RADIANS(T135))","v":-0.98573215320661112},null,null,null,null,266,{"$f":"COS(RADIANS(Sight3!HC3_))*COS(RADIANS(AA135))","v":-4.5882485603133912E-2},{"$f":"COS(RADIANS(Sight3!HC3_))*SIN(RADIANS(AA135))","v":-0.65615011363880527}]
[268,-3.4899496702500761E-2,-0.99939082701909576,null,-178,{"$f":"COS(RADIANS(E136))*COS(RADIANS(Sight3!LHA3_))","v":-0.95047890530548718},-3.4899496702501143E-2,{"$f":"F136*COS(RADIANS(90-Sight3!LAT3_))-G136*SIN(RADIANS(90-Sight3!LAT3_))","v":-0.67133486618799276},{"$f":"F136*SIN(RADIANS(90-Sight3!LAT3_))+G136*COS(RADIANS(90-Sight3!LAT3_))","v":-0.67374893079036124},null,{"$f":"COS(RADIANS(E136))*COS(RADIANS(Sight3!AZ_nord3-180))","v":-0.885176637039365},null,null,null,null,null,null,null,null,268,{"$f":"COS(RADIANS(Sight3!DEC3_))*COS(RADIANS(T136))","v":-3.4485561124043031E-2},{"$f":"COS(RADIANS(Sight3!DEC3_))*SIN(RADIANS(T136))","v":-0.98753726295156985},null,null,null,null,268,{"$f":"COS(RADIANS(Sight3!HC3_))*COS(RADIANS(AA136))","v":-2.2955226505324305E-2},{"$f":"COS(RADIANS(Sight3!HC3_))*SIN(RADIANS(AA136))","v":-0.65735168037316838}]
[270,-1.83772268236293E-16,-1,null,-180,{"$f":"COS(RADIANS(E137))*COS(RADIANS(Sight3!LHA3_))","v":-0.95105826430336649},-1.22514845490862E-16,{"$f":"F137*COS(RADIANS(90-Sight3!LAT3_))-G137*SIN(RADIANS(90-Sight3!LAT3_))","v":-0.69555998205377034},{"$f":"F137*SIN(RADIANS(90-Sight3!LAT3_))+G137*COS(RADIANS(90-Sight3!LAT3_))","v":-0.64862017657878224},null,{"$f":"COS(RADIANS(E137))*COS(RADIANS(Sight3!AZ_nord3-180))","v":-0.88571619141192259},null,null,null,null,null,null,null,null,270,{"$f":"COS(RADIANS(Sight3!DEC3_))*COS(RADIANS(T137))","v":-1.8159258407622232E-16},{"$f":"COS(RADIANS(Sight3!DEC3_))*SIN(RADIANS(T137))","v":-0.98813921066007604},null,null,null,null,270,{"$f":"COS(RADIANS(Sight3!HC3_))*COS(RADIANS(AA137))","v":-1.2087664411673413E-16},{"$f":"COS(RADIANS(Sight3!HC3_))*SIN(RADIANS(AA137))","v":-0.65775236534226078}]
[272,3.4899496702501281E-2,-0.99939082701909576,null,-182,{"$f":"COS(RADIANS(E138))*COS(RADIANS(Sight3!LHA3_))","v":-0.95047890530548718},3.48994967025009E-2,{"$f":"F138*COS(RADIANS(90-Sight3!LAT3_))-G138*SIN(RADIANS(90-Sight3!LAT3_))","v":-0.71893766522421731},{"$f":"F138*SIN(RADIANS(90-Sight3!LAT3_))+G138*COS(RADIANS(90-Sight3!LAT3_))","v":-0.62270117859432095},null,{"$f":"COS(RADIANS(E138))*COS(RADIANS(Sight3!AZ_nord3-180))","v":-0.885176637039365},null,null,null,null,null,null,null,null,272,{"$f":"COS(RADIANS(Sight3!DEC3_))*COS(RADIANS(T138))","v":3.4485561124043544E-2},{"$f":"COS(RADIANS(Sight3!DEC3_))*SIN(RADIANS(T138))","v":-0.98753726295156985},null,null,null,null,272,{"$f":"COS(RADIANS(Sight3!HC3_))*COS(RADIANS(AA138))","v":2.2955226505324649E-2},{"$f":"COS(RADIANS(Sight3!HC3_))*SIN(RADIANS(AA138))","v":-0.65735168037316838}]
[274,6.9756473744125219E-2,-0.99756405025982431,null,-184,{"$f":"COS(RADIANS(E139))*COS(RADIANS(Sight3!LHA3_))","v":-0.94874153417154461},6.9756473744125275E-2,{"$f":"F139*COS(RADIANS(90-Sight3!LAT3_))-G139*SIN(RADIANS(90-Sight3!LAT3_))","v":-0.741439433593446},{"$f":"F139*SIN(RADIANS(90-Sight3!LAT3_))+G139*COS(RADIANS(90-Sight3!LAT3_))","v":-0.59602351514350582},null,{"$f":"COS(RADIANS(E139))*COS(RADIANS(Sight3!AZ_nord3-180))","v":-0.88355863128558321},null,null,null,null,null,null,null,null,274,{"$f":"COS(RADIANS(Sight3!DEC3_))*COS(RADIANS(T139))","v":6.892910690395021E-2},{"$f":"COS(RADIANS(Sight3!DEC3_))*SIN(RADIANS(T139))","v":-0.98573215320661123},null,null,null,null,274,{"$f":"COS(RADIANS(Sight3!HC3_))*COS(RADIANS(AA139))","v":4.5882485603133676E-2},{"$f":"COS(RADIANS(Sight3!HC3_))*SIN(RADIANS(AA139))","v":-0.65615011363880538}]
[276,0.10452846326765299,-0.9945218953682734,null,-186,{"$f":"COS(RADIANS(E140))*COS(RADIANS(Sight3!LHA3_))","v":-0.94584826762064422},0.1045284632676535,{"$f":"F140*COS(RADIANS(90-Sight3!LAT3_))-G140*SIN(RADIANS(90-Sight3!LAT3_))","v":-0.7630378722228307},{"$f":"F140*SIN(RADIANS(90-Sight3!LAT3_))+G140*COS(RADIANS(90-Sight3!LAT3_))","v":-0.56861968884987268},null,{"$f":"COS(RADIANS(E140))*COS(RADIANS(Sight3!AZ_nord3-180))","v":-0.88086414544135361},null,null,null,null,null,null,null,null,276,{"$f":"COS(RADIANS(Sight3!DEC3_))*COS(RADIANS(T140))","v":0.10328867318480937},{"$f":"COS(RADIANS(Sight3!DEC3_))*SIN(RADIANS(T140))","v":-0.98272608067336842},null,null,null,null,276,{"$f":"COS(RADIANS(Sight3!HC3_))*COS(RADIANS(AA140))","v":6.8753843959890371E-2},{"$f":"COS(RADIANS(Sight3!HC3_))*SIN(RADIANS(AA140))","v":-0.65414912906315026}]
[278,0.13917310096006547,-0.99026806874157036,null,-188,{"$f":"COS(RADIANS(E141))*COS(RADIANS(Sight3!LHA3_))","v":-0.94180263065240466},0.13917310096006552,{"$f":"F141*COS(RADIANS(90-Sight3!LAT3_))-G141*SIN(RADIANS(90-Sight3!LAT3_))","v":-0.78370666674188572},{"$f":"F141*SIN(RADIANS(90-Sight3!LAT3_))+G141*COS(RADIANS(90-Sight3!LAT3_))","v":-0.54052308705452456},null,{"$f":"COS(RADIANS(E141))*COS(RADIANS(Sight3!AZ_nord3-180))","v":-0.8770964623226235},null,null,null,null,null,null,null,null,278,{"$f":"COS(RADIANS(Sight3!DEC3_))*COS(RADIANS(T141))","v":0.13752239812779415},{"$f":"COS(RADIANS(Sight3!DEC3_))*SIN(RADIANS(T141))","v":-0.9785227077881733},null,null,null,null,278,{"$f":"COS(RADIANS(Sight3!HC3_))*COS(RADIANS(AA141))","v":9.154143634850033E-2},{"$f":"COS(RADIANS(Sight3!HC3_))*SIN(RADIANS(AA141))","v":-0.65135116453768038}]
[280,0.17364817766692997,-0.98480775301220813,null,-190,{"$f":"COS(RADIANS(E142))*COS(RADIANS(Sight3!LHA3_))","v":-0.93660955225228903},0.17364817766693047,{"$f":"F142*COS(RADIANS(90-Sight3!LAT3_))-G142*SIN(RADIANS(90-Sight3!LAT3_))","v":-0.80342063540827335},{"$f":"F142*SIN(RADIANS(90-Sight3!LAT3_))+G142*COS(RADIANS(90-Sight3!LAT3_))","v":-0.5117679411387992},null,{"$f":"COS(RADIANS(E142))*COS(RADIANS(Sight3!AZ_nord3-180))","v":-0.87226017227090624},null,null,null,null,null,null,null,null,280,{"$f":"COS(RADIANS(Sight3!DEC3_))*COS(RADIANS(T142))","v":0.17158857321236082},{"$f":"COS(RADIANS(Sight3!DEC3_))*SIN(RADIANS(T142))","v":-0.97312715571340647},null,null,null,null,280,{"$f":"COS(RADIANS(Sight3!HC3_))*COS(RADIANS(AA142))","v":0.11421749959779633},{"$f":"COS(RADIANS(Sight3!HC3_))*SIN(RADIANS(AA142))","v":-0.64775962895117689}]
[282,0.20791169081775943,-0.97814760073380558,null,-192,{"$f":"COS(RADIANS(E143))*COS(RADIANS(Sight3!LHA3_))","v":-0.9302753593863955},0.20791169081775951,{"$f":"F143*COS(RADIANS(90-Sight3!LAT3_))-G143*SIN(RADIANS(90-Sight3!LAT3_))","v":-0.82215575978787769},{"$f":"F143*SIN(RADIANS(90-Sight3!LAT3_))+G143*COS(RADIANS(90-Sight3!LAT3_))","v":-0.48238928481860421},null,{"$f":"COS(RADIANS(E143))*COS(RADIANS(Sight3!AZ_nord3-180))","v":-0.86636116756065618},null,null,null,null,null,null,null,null,282,{"$f":"COS(RADIANS(Sight3!DEC3_))*COS(RADIANS(T143))","v":0.20544569405166258},{"$f":"COS(RADIANS(Sight3!DEC3_))*SIN(RADIANS(T143))","v":-0.96654599809814989},null,null,null,null,282,{"$f":"COS(RADIANS(Sight3!HC3_))*COS(RADIANS(AA143))","v":0.13675440641769007},{"$f":"COS(RADIANS(Sight3!HC3_))*SIN(RADIANS(AA143))","v":-0.64337889803651793}]
[284,0.24192189559966745,-0.97029572627599658,null,-194,{"$f":"COS(RADIANS(E144))*COS(RADIANS(Sight3!LHA3_))","v":-0.92280776929302355},0.24192189559966751,{"$f":"F144*COS(RADIANS(90-Sight3!LAT3_))-G144*SIN(RADIANS(90-Sight3!LAT3_))","v":-0.83988921401756644},{"$f":"F144*SIN(RADIANS(90-Sight3!LAT3_))+G144*COS(RADIANS(90-Sight3!LAT3_))","v":-0.45242291146123115},null,{"$f":"COS(RADIANS(E144))*COS(RADIANS(Sight3!AZ_nord3-180))","v":-0.85940663522044092},null,null,null,null,null,null,null,null,284,{"$f":"COS(RADIANS(Sight3!DEC3_))*COS(RADIANS(T144))","v":0.23905251095924471},{"$f":"COS(RADIANS(Sight3!DEC3_))*SIN(RADIANS(T144))","v":-0.95878725306920842},null,null,null,null,284,{"$f":"COS(RADIANS(Sight3!HC3_))*COS(RADIANS(AA144))","v":0.15912469905876472},{"$f":"COS(RADIANS(Sight3!HC3_))*SIN(RADIANS(AA144))","v":-0.63821430903952359}]
[286,0.27563735581699939,-0.96126169593831878,null,-196,{"$f":"COS(RADIANS(E145))*COS(RADIANS(Sight3!LHA3_))","v":-0.91421588008040799},0.275637355816999,{"$f":"F145*COS(RADIANS(90-Sight3!LAT3_))-G145*SIN(RADIANS(90-Sight3!LAT3_))","v":-0.85659939261499063},{"$f":"F145*SIN(RADIANS(90-Sight3!LAT3_))+G145*COS(RADIANS(90-Sight3!LAT3_))","v":-0.42190533047664946},null,{"$f":"COS(RADIANS(E145))*COS(RADIANS(Sight3!AZ_nord3-180))","v":-0.85140504827665342},null,null,null,null,null,null,null,null,286,{"$f":"COS(RADIANS(Sight3!DEC3_))*COS(RADIANS(T145))","v":0.27236807920544032},{"$f":"COS(RADIANS(Sight3!DEC3_))*SIN(RADIANS(T145))","v":-0.94986037346225638},null,null,null,null,286,{"$f":"COS(RADIANS(Sight3!HC3_))*COS(RADIANS(AA145))","v":0.18130112276531771},{"$f":"COS(RADIANS(Sight3!HC3_))*SIN(RADIANS(AA145))","v":-0.6322721542163422}]
[288,0.30901699437494723,-0.95105651629515364,null,-198,{"$f":"COS(RADIANS(E146))*COS(RADIANS(Sight3!LHA3_))","v":-0.90451015964207526},0.30901699437494728,{"$f":"F146*COS(RADIANS(90-Sight3!LAT3_))-G146*SIN(RADIANS(90-Sight3!LAT3_))","v":-0.87226593680153486},{"$f":"F146*SIN(RADIANS(90-Sight3!LAT3_))+G146*COS(RADIANS(90-Sight3!LAT3_))","v":-0.39087372283641592},null,{"$f":"COS(RADIANS(E146))*COS(RADIANS(Sight3!AZ_nord3-180))","v":-0.84236615543043458},null,null,null,null,null,null,null,null,288,{"$f":"COS(RADIANS(Sight3!DEC3_))*COS(RADIANS(T146))","v":0.30535180890220953},{"$f":"COS(RADIANS(Sight3!DEC3_))*SIN(RADIANS(T146))","v":-0.93977623530501486},null,null,null,null,288,{"$f":"COS(RADIANS(Sight3!HC3_))*COS(RADIANS(AA146))","v":0.20325665898107764},{"$f":"COS(RADIANS(Sight3!HC3_))*SIN(RADIANS(AA146))","v":-0.62555967316730765}]
[290,0.34202014332566899,-0.93969262078590832,null,-200,{"$f":"COS(RADIANS(E147))*COS(RADIANS(Sight3!LHA3_))","v":-0.89370243290332763},0.34202014332566866,{"$f":"F147*COS(RADIANS(90-Sight3!LAT3_))-G147*SIN(RADIANS(90-Sight3!LAT3_))","v":-0.8868697593063537},{"$f":"F147*SIN(RADIANS(90-Sight3!LAT3_))+G147*COS(RADIANS(90-Sight3!LAT3_))","v":-0.35936589577438749},null,{"$f":"COS(RADIANS(E147))*COS(RADIANS(Sight3!AZ_nord3-180))","v":-0.83230096918038288},null,null,null,null,null,null,null,null,290,{"$f":"COS(RADIANS(Sight3!DEC3_))*COS(RADIANS(T147))","v":0.33796351445567263},{"$f":"COS(RADIANS(Sight3!DEC3_))*SIN(RADIANS(T147))","v":-0.92854712456648558},null,null,null,null,290,{"$f":"COS(RADIANS(Sight3!HC3_))*COS(RADIANS(AA147))","v":0.22496455826715783},{"$f":"COS(RADIANS(Sight3!HC3_))*SIN(RADIANS(AA147))","v":-0.61808504401659925}]
[292,0.37460659341591196,-0.92718385456678742,null,-202,{"$f":"COS(RADIANS(E148))*COS(RADIANS(Sight3!LHA3_))","v":-0.88180586741439382},0.37460659341591201,{"$f":"F148*COS(RADIANS(90-Sight3!LAT3_))-G148*SIN(RADIANS(90-Sight3!LAT3_))","v":-0.90039306762127147},{"$f":"F148*SIN(RADIANS(90-Sight3!LAT3_))+G148*COS(RADIANS(90-Sight3!LAT3_))","v":-0.32742023672443071},null,{"$f":"COS(RADIANS(E148))*COS(RADIANS(Sight3!AZ_nord3-180))","v":-0.82122175240552087},null,null,null,null,null,null,null,null,292,{"$f":"COS(RADIANS(Sight3!DEC3_))*COS(RADIANS(T148))","v":0.37016346352605928},{"$f":"COS(RADIANS(Sight3!DEC3_))*SIN(RADIANS(T148))","v":-0.91618672218839203},null,null,null,null,292,{"$f":"COS(RADIANS(Sight3!HC3_))*COS(RADIANS(AA148))","v":0.24639837289212266},{"$f":"COS(RADIANS(Sight3!HC3_))*SIN(RADIANS(AA148))","v":-0.60985737344845914}]
[294,0.40673664307579976,-0.91354545764260109,null,-204,{"$f":"COS(RADIANS(E149))*COS(RADIANS(Sight3!LHA3_))","v":-0.86883495730779658},0.40673664307580021,{"$f":"F149*COS(RADIANS(90-Sight3!LAT3_))-G149*SIN(RADIANS(90-Sight3!LAT3_))","v":-0.91281938567821252},{"$f":"F149*SIN(RADIANS(90-Sight3!LAT3_))+G149*COS(RADIANS(90-Sight3!LAT3_))","v":-0.29507566655124634},null,{"$f":"COS(RADIANS(E149))*COS(RADIANS(Sight3!AZ_nord3-180))","v":-0.80914200342486631},null,null,null,null,null,null,null,null,294,{"$f":"COS(RADIANS(Sight3!DEC3_))*COS(RADIANS(T149))","v":0.40191242543544986},{"$f":"COS(RADIANS(Sight3!DEC3_))*SIN(RADIANS(T149))","v":-0.90271008741705772},null,null,null,null,294,{"$f":"COS(RADIANS(Sight3!HC3_))*COS(RADIANS(AA149))","v":0.26753198905447817},{"$f":"COS(RADIANS(Sight3!HC3_))*SIN(RADIANS(AA149))","v":-0.60088668561209901}]
[296,0.4383711467890774,-0.89879404629916704,null,-206,{"$f":"COS(RADIANS(E150))*COS(RADIANS(Sight3!LHA3_))","v":-0.85480550563948532},0.43837114678907746,{"$f":"F150*COS(RADIANS(90-Sight3!LAT3_))-G150*SIN(RADIANS(90-Sight3!LAT3_))","v":-0.92413357392275197},{"$f":"F150*SIN(RADIANS(90-Sight3!LAT3_))+G150*COS(RADIANS(90-Sight3!LAT3_))","v":-0.26237159213129124},null,{"$f":"COS(RADIANS(E150))*COS(RADIANS(Sight3!AZ_nord3-180))","v":-0.7960764395518094},null,null,null,null,null,null,null,null,296,{"$f":"COS(RADIANS(Sight3!DEC3_))*COS(RADIANS(T150))","v":0.43317171896431128},{"$f":"COS(RADIANS(Sight3!DEC3_))*SIN(RADIANS(T150))","v":-0.88813363945603474},null,null,null,null,296,{"$f":"COS(RADIANS(Sight3!HC3_))*COS(RADIANS(AA150))","v":0.28833965869831507},{"$f":"COS(RADIANS(Sight3!HC3_))*SIN(RADIANS(AA150))","v":-0.59118390990881853}]
[298,0.46947156278589042,-0.8829475928589271,null,-208,{"$f":"COS(RADIANS(E151))*COS(RADIANS(Sight3!LHA3_))","v":-0.83973460513524645},0.46947156278589086,{"$f":"F151*COS(RADIANS(90-Sight3!LAT3_))-G151*SIN(RADIANS(90-Sight3!LAT3_))","v":-0.9343218477593308},{"$f":"F151*SIN(RADIANS(90-Sight3!LAT3_))+G151*COS(RADIANS(90-Sight3!LAT3_))","v":-0.22934785834156973},null,{"$f":"COS(RADIANS(E151))*COS(RADIANS(Sight3!AZ_nord3-180))","v":-0.78204097916333359},null,null,null,null,null,null,null,null,298,{"$f":"COS(RADIANS(Sight3!DEC3_))*COS(RADIANS(T151))","v":0.46390325947860206},{"$f":"COS(RADIANS(Sight3!DEC3_))*SIN(RADIANS(T151))","v":-0.87247513746183436},null,null,null,null,298,{"$f":"COS(RADIANS(Sight3!HC3_))*COS(RADIANS(AA151))","v":0.30879603088334712},{"$f":"COS(RADIANS(Sight3!HC3_))*SIN(RADIANS(AA151))","v":-0.58076086767621471}]
[300,0.50000000000000011,-0.8660254037844386,null,-210,{"$f":"COS(RADIANS(E152))*COS(RADIANS(Sight3!LHA3_))","v":-0.82364061736585026},0.50000000000000011,{"$f":"F152*COS(RADIANS(90-Sight3!LAT3_))-G152*SIN(RADIANS(90-Sight3!LAT3_))","v":-0.94337179434566265},{"$f":"F152*SIN(RADIANS(90-Sight3!LAT3_))+G152*COS(RADIANS(90-Sight3!LAT3_))","v":-0.19604469951478837},null,{"$f":"COS(RADIANS(E152))*COS(RADIANS(Sight3!AZ_nord3-180))","v":-0.76705272230592536},null,null,null,null,null,null,null,null,300,{"$f":"COS(RADIANS(Sight3!DEC3_))*COS(RADIANS(T152))","v":0.49406960533003813},{"$f":"COS(RADIANS(Sight3!DEC3_))*SIN(RADIANS(T152))","v":-0.85575365890712873},null,null,null,null,300,{"$f":"COS(RADIANS(Sight3!HC3_))*COS(RADIANS(AA152))","v":0.32887618267113045},{"$f":"COS(RADIANS(Sight3!HC3_))*SIN(RADIANS(AA152))","v":-0.56963025778570098}]
[302,0.52991926423320468,-0.84804809615642618,null,-212,{"$f":"COS(RADIANS(E153))*COS(RADIANS(Sight3!LHA3_))","v":-0.80654315037630497},0.52991926423320479,{"$f":"F153*COS(RADIANS(90-Sight3!LAT3_))-G153*SIN(RADIANS(90-Sight3!LAT3_))","v":-0.95127238771586931},{"$f":"F153*SIN(RADIANS(90-Sight3!LAT3_))+G153*COS(RADIANS(90-Sight3!LAT3_))","v":-0.16250269042001947},null,{"$f":"COS(RADIANS(E153))*COS(RADIANS(Sight3!AZ_nord3-180))","v":-0.7511299298618016},null,null,null,null,null,null,null,null,302,{"$f":"COS(RADIANS(Sight3!DEC3_))*COS(RADIANS(T153))","v":0.52363400347296718},{"$f":"COS(RADIANS(Sight3!DEC3_))*SIN(RADIANS(T153))","v":-0.83798957633779125},null,null,null,null,302,{"$f":"COS(RADIANS(Sight3!HC3_))*COS(RADIANS(AA153))","v":0.34855564948982087},{"$f":"COS(RADIANS(Sight3!HC3_))*SIN(RADIANS(AA153))","v":-0.55780564117089038}]
[304,0.55919290347074702,-0.82903757255504162,null,-214,{"$f":"COS(RADIANS(E154))*COS(RADIANS(Sight3!LHA3_))","v":-0.78846303479647439},0.55919290347074668,{"$f":"F154*COS(RADIANS(90-Sight3!LAT3_))-G154*SIN(RADIANS(90-Sight3!LAT3_))","v":-0.95801400221392263},{"$f":"F154*SIN(RADIANS(90-Sight3!LAT3_))+G154*COS(RADIANS(90-Sight3!LAT3_))","v":-0.12876269682859415},null,{"$f":"COS(RADIANS(E154))*COS(RADIANS(Sight3!AZ_nord3-180))","v":-0.73429200130083716},null,null,null,null,null,null,null,null,304,{"$f":"COS(RADIANS(Sight3!DEC3_))*COS(RADIANS(T154))","v":0.55256043424230006},{"$f":"COS(RADIANS(Sight3!DEC3_))*SIN(RADIANS(T154))","v":-0.81920453255208436},null,null,null,null,304,{"$f":"COS(RADIANS(Sight3!HC3_))*COS(RADIANS(AA154))","v":0.36781045494049036},{"$f":"COS(RADIANS(Sight3!HC3_))*SIN(RADIANS(AA154))","v":-0.54530142430568473}]
[306,0.58778525229247292,-0.80901699437494756,null,-216,{"$f":"COS(RADIANS(E155))*COS(RADIANS(Sight3!LHA3_))","v":-0.76942229846216403},0.58778525229247303,{"$f":"F155*COS(RADIANS(90-Sight3!LAT3_))-G155*SIN(RADIANS(90-Sight3!LAT3_))","v":-0.96358842422102231},{"$f":"F155*SIN(RADIANS(90-Sight3!LAT3_))+G155*COS(RADIANS(90-Sight3!LAT3_))","v":-9.4865825725455988E-2},null,{"$f":"COS(RADIANS(E155))*COS(RADIANS(Sight3!AZ_nord3-180))","v":-0.71655945104529939},null,null,null,null,null,null,null,null,306,{"$f":"COS(RADIANS(Sight3!DEC3_))*COS(RADIANS(T155))","v":0.58081365523791784},{"$f":"COS(RADIANS(Sight3!DEC3_))*SIN(RADIANS(T155))","v":-0.79942141423224788},null,null,null,null,306,{"$f":"COS(RADIANS(Sight3!HC3_))*COS(RADIANS(AA155))","v":0.38661714000867159},{"$f":"COS(RADIANS(Sight3!HC3_))*SIN(RADIANS(AA155))","v":-0.5321328416522082}]
[308,0.61566147532565851,-0.78801075360672179,null,-218,{"$f":"COS(RADIANS(E156))*COS(RADIANS(Sight3!LHA3_))","v":-0.74944413957759681},0.61566147532565818,{"$f":"F156*COS(RADIANS(90-Sight3!LAT3_))-G156*SIN(RADIANS(90-Sight3!LAT3_))","v":-0.96798886216262692},{"$f":"F156*SIN(RADIANS(90-Sight3!LAT3_))+G156*COS(RADIANS(90-Sight3!LAT3_))","v":-6.0853375226631479E-2},null,{"$f":"COS(RADIANS(E156))*COS(RADIANS(Sight3!AZ_nord3-180))","v":-0.69795388347618481},null,null,null,null,null,null,null,null,308,{"$f":"COS(RADIANS(Sight3!DEC3_))*COS(RADIANS(T156))","v":0.60835924426211407},{"$f":"COS(RADIANS(Sight3!DEC3_))*SIN(RADIANS(T156))","v":-0.77866432406059771},null,null,null,null,308,{"$f":"COS(RADIANS(Sight3!HC3_))*COS(RADIANS(AA156))","v":0.40495279164555781},{"$f":"COS(RADIANS(Sight3!HC3_))*SIN(RADIANS(AA156))","v":-0.51831593709995871}]
[310,0.64278760968653925,-0.76604444311897812,null,-220,{"$f":"COS(RADIANS(E157))*COS(RADIANS(Sight3!LHA3_))","v":-0.72855289845197424},0.64278760968653925,{"$f":"F157*COS(RADIANS(90-Sight3!LAT3_))-G157*SIN(RADIANS(90-Sight3!LAT3_))","v":-0.97120995478294014},{"$f":"F157*SIN(RADIANS(90-Sight3!LAT3_))+G157*COS(RADIANS(90-Sight3!LAT3_))","v":-2.6766784263837384E-2},null,{"$f":"COS(RADIANS(E157))*COS(RADIANS(Sight3!AZ_nord3-180))","v":-0.67849796661160833},null,null,null,null,null,null,null,null,310,{"$f":"COS(RADIANS(Sight3!DEC3_))*COS(RADIANS(T157))","v":0.63516364125773395},{"$f":"COS(RADIANS(Sight3!DEC3_))*SIN(RADIANS(T157))","v":-0.7569585513541246},null,null,null,null,310,{"$f":"COS(RADIANS(Sight3!HC3_))*COS(RADIANS(AA157))","v":0.42279507068401911},{"$f":"COS(RADIANS(Sight3!HC3_))*SIN(RADIANS(AA157))","v":-0.50386754441880277}]
[312,0.66913060635885779,-0.74314482547739458,null,-222,{"$f":"COS(RADIANS(E158))*COS(RADIANS(Sight3!LHA3_))","v":-0.70677402784455878},0.66913060635885824,{"$f":"F158*COS(RADIANS(90-Sight3!LAT3_))-G158*SIN(RADIANS(90-Sight3!LAT3_))","v":-0.97324777767677517},{"$f":"F158*SIN(RADIANS(90-Sight3!LAT3_))+G158*COS(RADIANS(90-Sight3!LAT3_))","v":7.3524179024752612E-3},null,{"$f":"COS(RADIANS(E158))*COS(RADIANS(Sight3!AZ_nord3-180))","v":-0.65821540448931548},null,null,null,null,null,null,null,null,312,{"$f":"COS(RADIANS(Sight3!DEC3_))*COS(RADIANS(T158))","v":0.66119418919593975},{"$f":"COS(RADIANS(Sight3!DEC3_))*SIN(RADIANS(T158))","v":-0.73433054125335262},null,null,null,null,312,{"$f":"COS(RADIANS(Sight3!HC3_))*COS(RADIANS(AA158))","v":0.4401222390554399},{"$f":"COS(RADIANS(Sight3!HC3_))*SIN(RADIANS(AA158))","v":-0.48880526674961788}]
[314,0.69465837045899725,-0.71933980033865119,null,-224,{"$f":"COS(RADIANS(E159))*COS(RADIANS(Sight3!LHA3_))","v":-0.68413406195440774},0.69465837045899737,{"$f":"F159*COS(RADIANS(90-Sight3!LAT3_))-G159*SIN(RADIANS(90-Sight3!LAT3_))","v":-0.97409984807083871},{"$f":"F159*SIN(RADIANS(90-Sight3!LAT3_))+G159*COS(RADIANS(90-Sight3!LAT3_))","v":4.1462662280126961E-2},null,{"$f":"COS(RADIANS(E159))*COS(RADIANS(Sight3!AZ_nord3-180))","v":-0.63713090828696284},null,null,null,null,null,null,null,null,314,{"$f":"COS(RADIANS(Sight3!DEC3_))*COS(RADIANS(T159))","v":0.68641917386376827},{"$f":"COS(RADIANS(Sight3!DEC3_))*SIN(RADIANS(T159))","v":-0.71080786250301153},null,null,null,null,314,{"$f":"COS(RADIANS(Sight3!HC3_))*COS(RADIANS(AA159))","v":0.45691318627420591},{"$f":"COS(RADIANS(Sight3!HC3_))*SIN(RADIANS(AA159))","v":-0.47314745515757745}]
[316,0.71933980033865086,-0.69465837045899759,null,-226,{"$f":"COS(RADIANS(E160))*COS(RADIANS(Sight3!LHA3_))","v":-0.66066058409253892},0.71933980033865119,{"$f":"F160*COS(RADIANS(90-Sight3!LAT3_))-G160*SIN(RADIANS(90-Sight3!LAT3_))","v":-0.9737651278486068},{"$f":"F160*SIN(RADIANS(90-Sight3!LAT3_))+G160*COS(RADIANS(90-Sight3!LAT3_))","v":7.5522390790623617E-2},null,{"$f":"COS(RADIANS(E160))*COS(RADIANS(Sight3!AZ_nord3-180))","v":-0.61527016621535546},null,null,null,null,null,null,null,null,316,{"$f":"COS(RADIANS(Sight3!DEC3_))*COS(RADIANS(T160))","v":0.7108078625030112},{"$f":"COS(RADIANS(Sight3!DEC3_))*SIN(RADIANS(T160))","v":-0.68641917386376861},null,null,null,null,316,{"$f":"COS(RADIANS(Sight3!HC3_))*COS(RADIANS(AA160))","v":0.47314745515757722},{"$f":"COS(RADIANS(Sight3!HC3_))*SIN(RADIANS(AA160))","v":-0.45691318627420613}]
[318,0.74314482547739424,-0.66913060635885813,null,-228,{"$f":"COS(RADIANS(E161))*COS(RADIANS(Sight3!LHA3_))","v":-0.63638219307591481},0.74314482547739436,{"$f":"F161*COS(RADIANS(90-Sight3!LAT3_))-G161*SIN(RADIANS(90-Sight3!LAT3_))","v":-0.97224402481511052},{"$f":"F161*SIN(RADIANS(90-Sight3!LAT3_))+G161*COS(RADIANS(90-Sight3!LAT3_))","v":0.10949010690127464},null,{"$f":"COS(RADIANS(E161))*COS(RADIANS(Sight3!AZ_nord3-180))","v":-0.59265981222131825},null,null,null,null,null,null,null,null,318,{"$f":"COS(RADIANS(Sight3!DEC3_))*COS(RADIANS(T161))","v":0.73433054125335229},{"$f":"COS(RADIANS(Sight3!DEC3_))*SIN(RADIANS(T161))","v":-0.66119418919594009},null,null,null,null,318,{"$f":"COS(RADIANS(Sight3!HC3_))*COS(RADIANS(AA161))","v":0.48880526674961766},{"$f":"COS(RADIANS(Sight3!HC3_))*SIN(RADIANS(AA161))","v":-0.44012223905544012}]
[320,0.76604444311897779,-0.64278760968653958,null,-230,{"$f":"COS(RADIANS(E162))*COS(RADIANS(Sight3!LHA3_))","v":-0.61132846838419008},0.7660444431189779,{"$f":"F162*COS(RADIANS(90-Sight3!LAT3_))-G162*SIN(RADIANS(90-Sight3!LAT3_))","v":-0.96953839220008819},{"$f":"F162*SIN(RADIANS(90-Sight3!LAT3_))+G162*COS(RADIANS(90-Sight3!LAT3_))","v":0.14332442618232399},null,{"$f":"COS(RADIANS(E162))*COS(RADIANS(Sight3!AZ_nord3-180))","v":-0.56932739353833517},null,null,null,null,null,null,null,null,320,{"$f":"COS(RADIANS(Sight3!DEC3_))*COS(RADIANS(T162))","v":0.75695855135412426},{"$f":"COS(RADIANS(Sight3!DEC3_))*SIN(RADIANS(T162))","v":-0.63516364125773428},null,null,null,null,320,{"$f":"COS(RADIANS(Sight3!HC3_))*COS(RADIANS(AA162))","v":0.50386754441880255},{"$f":"COS(RADIANS(Sight3!HC3_))*SIN(RADIANS(AA162))","v":-0.42279507068401934}]
[322,0.78801075360672201,-0.61566147532565818,null,-232,{"$f":"COS(RADIANS(E163))*COS(RADIANS(Sight3!LHA3_))","v":-0.5855299341216702},0.78801075360672213,{"$f":"F163*COS(RADIANS(90-Sight3!LAT3_))-G163*SIN(RADIANS(90-Sight3!LAT3_))","v":-0.96565152640011065},{"$f":"F163*SIN(RADIANS(90-Sight3!LAT3_))+G163*COS(RADIANS(90-Sight3!LAT3_))","v":0.17698412672750652},null,{"$f":"COS(RADIANS(E163))*COS(RADIANS(Sight3!AZ_nord3-180))","v":-0.54530133712448725},null,null,null,null,null,null,null,null,{"$f":"SUM(T162+2)","v":322},{"$f":"COS(RADIANS(Sight3!DEC3_))*COS(RADIANS(T163))","v":0.77866432406059793},{"$f":"COS(RADIANS(Sight3!DEC3_))*SIN(RADIANS(T163))","v":-0.60835924426211374},null,null,null,null,322,{"$f":"COS(RADIANS(Sight3!HC3_))*COS(RADIANS(AA163))","v":0.51831593709995882},{"$f":"COS(RADIANS(Sight3!HC3_))*SIN(RADIANS(AA163))","v":-0.40495279164555759}]
[324,0.80901699437494734,-0.58778525229247336,null,-234,{"$f":"COS(RADIANS(E164))*COS(RADIANS(Sight3!LHA3_))","v":-0.55901802182839599},0.80901699437494734,{"$f":"F164*COS(RADIANS(90-Sight3!LAT3_))-G164*SIN(RADIANS(90-Sight3!LAT3_))","v":-0.96058816296242922},{"$f":"F164*SIN(RADIANS(90-Sight3!LAT3_))+G164*COS(RADIANS(90-Sight3!LAT3_))","v":0.2104281993765853},null,{"$f":"COS(RADIANS(E164))*COS(RADIANS(Sight3!AZ_nord3-180))","v":-0.52061091502858547},null,null,null,null,null,null,null,null,324,{"$f":"COS(RADIANS(Sight3!DEC3_))*COS(RADIANS(T164))","v":0.79942141423224766},{"$f":"COS(RADIANS(Sight3!DEC3_))*SIN(RADIANS(T164))","v":-0.58081365523791828},null,null,null,null,324,{"$f":"COS(RADIANS(Sight3!HC3_))*COS(RADIANS(AA164))","v":0.53213284165220809},{"$f":"COS(RADIANS(Sight3!HC3_))*SIN(RADIANS(AA164))","v":-0.38661714000867187}]
[326,0.82903757255504185,-0.55919290347074657,null,-236,{"$f":"COS(RADIANS(E165))*COS(RADIANS(Sight3!LHA3_))","v":-0.53182503218564825},0.82903757255504185,{"$f":"F165*COS(RADIANS(90-Sight3!LAT3_))-G165*SIN(RADIANS(90-Sight3!LAT3_))","v":-0.95435447081544145},{"$f":"F165*SIN(RADIANS(90-Sight3!LAT3_))+G165*COS(RADIANS(90-Sight3!LAT3_))","v":0.24361589767870384},null,{"$f":"COS(RADIANS(E165))*COS(RADIANS(Sight3!AZ_nord3-180))","v":-0.49528620872668455},null,null,null,null,null,null,null,null,326,{"$f":"COS(RADIANS(Sight3!DEC3_))*COS(RADIANS(T165))","v":0.81920453255208459},{"$f":"COS(RADIANS(Sight3!DEC3_))*SIN(RADIANS(T165))","v":-0.55256043424229961},null,null,null,null,326,{"$f":"COS(RADIANS(Sight3!HC3_))*COS(RADIANS(AA165))","v":0.54530142430568496},{"$f":"COS(RADIANS(Sight3!HC3_))*SIN(RADIANS(AA165))","v":-0.36781045494049008}]
[328,0.84804809615642596,-0.52991926423320501,null,-238,{"$f":"COS(RADIANS(E166))*COS(RADIANS(Sight3!LHA3_))","v":-0.50398409566254898},0.84804809615642596,{"$f":"F166*COS(RADIANS(90-Sight3!LAT3_))-G166*SIN(RADIANS(90-Sight3!LAT3_))","v":-0.94695804475280188},{"$f":"F166*SIN(RADIANS(90-Sight3!LAT3_))+G166*COS(RADIANS(90-Sight3!LAT3_))","v":0.27650678753565261},null,{"$f":"COS(RADIANS(E166))*COS(RADIANS(Sight3!AZ_nord3-180))","v":-0.4693580724724426},null,null,null,null,null,null,null,null,328,{"$f":"COS(RADIANS(Sight3!DEC3_))*COS(RADIANS(T166))","v":0.83798957633779103},{"$f":"COS(RADIANS(Sight3!DEC3_))*SIN(RADIANS(T166))","v":-0.52363400347296751},null,null,null,null,328,{"$f":"COS(RADIANS(Sight3!HC3_))*COS(RADIANS(AA166))","v":0.55780564117089015},{"$f":"COS(RADIANS(Sight3!HC3_))*SIN(RADIANS(AA166))","v":-0.3485556494898211}]
[330,0.86602540378443837,-0.50000000000000044,null,-240,{"$f":"COS(RADIANS(E167))*COS(RADIANS(Sight3!LHA3_))","v":-0.47552913215168369},0.86602540378443837,{"$f":"F167*COS(RADIANS(90-Sight3!LAT3_))-G167*SIN(RADIANS(90-Sight3!LAT3_))","v":-0.93840789618033549},{"$f":"F167*SIN(RADIANS(90-Sight3!LAT3_))+G167*COS(RADIANS(90-Sight3!LAT3_))","v":0.30906079646459433},null,{"$f":"COS(RADIANS(E167))*COS(RADIANS(Sight3!AZ_nord3-180))","v":-0.44285809570596169},null,null,null,null,null,null,null,null,330,{"$f":"COS(RADIANS(Sight3!DEC3_))*COS(RADIANS(T167))","v":0.85575365890712851},{"$f":"COS(RADIANS(Sight3!DEC3_))*SIN(RADIANS(T167))","v":-0.49406960533003846},null,null,null,null,330,{"$f":"COS(RADIANS(Sight3!HC3_))*COS(RADIANS(AA167))","v":0.56963025778570087},{"$f":"COS(RADIANS(Sight3!HC3_))*SIN(RADIANS(AA167))","v":-0.32887618267113067}]
[332,0.88294759285892688,-0.46947156278589081,null,-242,{"$f":"COS(RADIANS(E168))*COS(RADIANS(Sight3!LHA3_))","v":-0.4464948096429382},0.88294759285892699,{"$f":"F168*COS(RADIANS(90-Sight3!LAT3_))-G168*SIN(RADIANS(90-Sight3!LAT3_))","v":-0.92871444213702858},{"$f":"F168*SIN(RADIANS(90-Sight3!LAT3_))+G168*COS(RADIANS(90-Sight3!LAT3_))","v":0.34123826242021116},null,{"$f":"COS(RADIANS(E168))*COS(RADIANS(Sight3!AZ_nord3-180))","v":-0.41581856456692246},null,null,null,null,null,null,null,null,332,{"$f":"COS(RADIANS(Sight3!DEC3_))*COS(RADIANS(T168))","v":0.87247513746183425},{"$f":"COS(RADIANS(Sight3!DEC3_))*SIN(RADIANS(T168))","v":-0.46390325947860245},null,null,null,null,332,{"$f":"COS(RADIANS(Sight3!HC3_))*COS(RADIANS(AA168))","v":0.5807608676762146},{"$f":"COS(RADIANS(Sight3!HC3_))*SIN(RADIANS(AA168))","v":-0.30879603088334739}]
[334,0.89879404629916682,-0.43837114678907779,null,-244,{"$f":"COS(RADIANS(E169))*COS(RADIANS(Sight3!LHA3_))","v":-0.41691650198589658},0.89879404629916682,{"$f":"F169*COS(RADIANS(90-Sight3!LAT3_))-G169*SIN(RADIANS(90-Sight3!LAT3_))","v":-0.91788949260347086},{"$f":"F169*SIN(RADIANS(90-Sight3!LAT3_))+G169*COS(RADIANS(90-Sight3!LAT3_))","v":0.37299998211679281},null,{"$f":"COS(RADIANS(E169))*COS(RADIANS(Sight3!AZ_nord3-180))","v":-0.38827242255889877},null,null,null,null,null,null,null,null,334,{"$f":"COS(RADIANS(Sight3!DEC3_))*COS(RADIANS(T169))","v":0.88813363945603452},{"$f":"COS(RADIANS(Sight3!DEC3_))*SIN(RADIANS(T169))","v":-0.43317171896431167},null,null,null,null,334,{"$f":"COS(RADIANS(Sight3!HC3_))*COS(RADIANS(AA169))","v":0.59118390990881842},{"$f":"COS(RADIANS(Sight3!HC3_))*SIN(RADIANS(AA169))","v":-0.28833965869831535}]
[336,0.91354545764260098,-0.40673664307580015,null,-246,{"$f":"COS(RADIANS(E170))*COS(RADIANS(Sight3!LHA3_))","v":-0.38683024579224834},0.91354545764260098,{"$f":"F170*COS(RADIANS(90-Sight3!LAT3_))-G170*SIN(RADIANS(90-Sight3!LAT3_))","v":-0.9059462361132129},{"$f":"F170*SIN(RADIANS(90-Sight3!LAT3_))+G170*COS(RADIANS(90-Sight3!LAT3_))","v":0.40430725879140872},null,{"$f":"COS(RADIANS(E170))*COS(RADIANS(Sight3!AZ_nord3-180))","v":-0.36025323041276819},null,null,null,null,null,null,null,null,336,{"$f":"COS(RADIANS(Sight3!DEC3_))*COS(RADIANS(T170))","v":0.90271008741705761},{"$f":"COS(RADIANS(Sight3!DEC3_))*SIN(RADIANS(T170))","v":-0.40191242543545025},null,null,null,null,336,{"$f":"COS(RADIANS(Sight3!HC3_))*COS(RADIANS(AA170))","v":0.6008866856120989},{"$f":"COS(RADIANS(Sight3!HC3_))*SIN(RADIANS(AA170))","v":-0.26753198905447845}]
[338,0.92718385456678731,-0.37460659341591235,null,-248,{"$f":"COS(RADIANS(E171))*COS(RADIANS(Sight3!LHA3_))","v":-0.35627269653073446},0.92718385456678731,{"$f":"F171*COS(RADIANS(90-Sight3!LAT3_))-G171*SIN(RADIANS(90-Sight3!LAT3_))","v":-0.89289922368457109},{"$f":"F171*SIN(RADIANS(90-Sight3!LAT3_))+G171*COS(RADIANS(90-Sight3!LAT3_))","v":0.43512194934994536},null,{"$f":"COS(RADIANS(E171))*COS(RADIANS(Sight3!AZ_nord3-180))","v":-0.33179512519813642},null,null,null,null,null,null,null,null,338,{"$f":"COS(RADIANS(Sight3!DEC3_))*COS(RADIANS(T171))","v":0.91618672218839192},{"$f":"COS(RADIANS(Sight3!DEC3_))*SIN(RADIANS(T171))","v":-0.37016346352605967},null,null,null,null,338,{"$f":"COS(RADIANS(Sight3!HC3_))*COS(RADIANS(AA171))","v":0.60985737344845903},{"$f":"COS(RADIANS(Sight3!HC3_))*SIN(RADIANS(AA171))","v":-0.24639837289212291}]
[340,0.93969262078590843,-0.3420201433256686,null,-250,{"$f":"COS(RADIANS(E172))*COS(RADIANS(Sight3!LHA3_))","v":-0.32528108386809895},0.93969262078590843,{"$f":"F172*COS(RADIANS(90-Sight3!LAT3_))-G172*SIN(RADIANS(90-Sight3!LAT3_))","v":-0.87876435109245077},{"$f":"F172*SIN(RADIANS(90-Sight3!LAT3_))+G172*COS(RADIANS(90-Sight3!LAT3_))","v":0.46540651083859808},null,{"$f":"COS(RADIANS(E172))*COS(RADIANS(Sight3!AZ_nord3-180))","v":-0.30293277873257102},null,null,null,null,null,null,null,null,340,{"$f":"COS(RADIANS(Sight3!DEC3_))*COS(RADIANS(T172))","v":0.92854712456648569},{"$f":"COS(RADIANS(Sight3!DEC3_))*SIN(RADIANS(T172))","v":-0.33796351445567224},null,null,null,null,340,{"$f":"COS(RADIANS(Sight3!HC3_))*COS(RADIANS(AA172))","v":0.61808504401659936},{"$f":"COS(RADIANS(Sight3!HC3_))*SIN(RADIANS(AA172))","v":-0.22496455826715758}]
[342,0.95105651629515353,-0.30901699437494762,null,-252,{"$f":"COS(RADIANS(E173))*COS(RADIANS(Sight3!LHA3_))","v":-0.29389316631048079},0.95105651629515353,{"$f":"F173*COS(RADIANS(90-Sight3!LAT3_))-G173*SIN(RADIANS(90-Sight3!LAT3_))","v":-0.86355883950179624},{"$f":"F173*SIN(RADIANS(90-Sight3!LAT3_))+G173*COS(RADIANS(90-Sight3!LAT3_))","v":0.49512404618417039},null,{"$f":"COS(RADIANS(E173))*COS(RADIANS(Sight3!AZ_nord3-180))","v":-0.27370135533933804},null,null,null,null,null,null,null,null,342,{"$f":"COS(RADIANS(Sight3!DEC3_))*COS(RADIANS(T173))","v":0.93977623530501475},{"$f":"COS(RADIANS(Sight3!DEC3_))*SIN(RADIANS(T173))","v":-0.30535180890220992},null,null,null,null,342,{"$f":"COS(RADIANS(Sight3!HC3_))*COS(RADIANS(AA173))","v":0.62555967316730765},{"$f":"COS(RADIANS(Sight3!HC3_))*SIN(RADIANS(AA173))","v":-0.20325665898107789}]
[344,0.96126169593831889,-0.27563735581699894,null,-254,{"$f":"COS(RADIANS(E174))*COS(RADIANS(Sight3!LHA3_))","v":-0.26214718520048441},0.96126169593831901,{"$f":"F174*COS(RADIANS(90-Sight3!LAT3_))-G174*SIN(RADIANS(90-Sight3!LAT3_))","v":-0.84730121448625018},{"$f":"F174*SIN(RADIANS(90-Sight3!LAT3_))+G174*COS(RADIANS(90-Sight3!LAT3_))","v":0.52423834914748069},null,{"$f":"COS(RADIANS(E174))*COS(RADIANS(Sight3!AZ_nord3-180))","v":-0.2441364690050852},null,null,null,null,null,null,null,null,344,{"$f":"COS(RADIANS(Sight3!DEC3_))*COS(RADIANS(T174))","v":0.94986037346225649},{"$f":"COS(RADIANS(Sight3!DEC3_))*SIN(RADIANS(T174))","v":-0.27236807920543987},null,null,null,null,344,{"$f":"COS(RADIANS(Sight3!HC3_))*COS(RADIANS(AA174))","v":0.63227215421634231},{"$f":"COS(RADIANS(Sight3!HC3_))*SIN(RADIANS(AA174))","v":-0.18130112276531743}]
[346,0.97029572627599647,-0.24192189559966787,null,-256,{"$f":"COS(RADIANS(E175))*COS(RADIANS(Sight3!LHA3_))","v":-0.23008181812600029},0.97029572627599647,{"$f":"F175*COS(RADIANS(90-Sight3!LAT3_))-G175*SIN(RADIANS(90-Sight3!LAT3_))","v":-0.83001128345759956},{"$f":"F175*SIN(RADIANS(90-Sight3!LAT3_))+G175*COS(RADIANS(90-Sight3!LAT3_))","v":0.55271394843508126},null,{"$f":"COS(RADIANS(E175))*COS(RADIANS(Sight3!AZ_nord3-180))","v":-0.2142741399896905},null,null,null,null,null,null,null,null,346,{"$f":"COS(RADIANS(Sight3!DEC3_))*COS(RADIANS(T175))","v":0.95878725306920831},{"$f":"COS(RADIANS(Sight3!DEC3_))*SIN(RADIANS(T175))","v":-0.23905251095924512},null,null,null,null,346,{"$f":"COS(RADIANS(Sight3!HC3_))*COS(RADIANS(AA175))","v":0.63821430903952348},{"$f":"COS(RADIANS(Sight3!HC3_))*SIN(RADIANS(AA175))","v":-0.159124699058765}]
[348,0.97814760073380558,-0.20791169081775987,null,-258,{"$f":"COS(RADIANS(E176))*COS(RADIANS(Sight3!LHA3_))","v":-0.19773613179751681},0.97814760073380558,{"$f":"F176*COS(RADIANS(90-Sight3!LAT3_))-G176*SIN(RADIANS(90-Sight3!LAT3_))","v":-0.81171011153349304},{"$f":"F176*SIN(RADIANS(90-Sight3!LAT3_))+G176*COS(RADIANS(90-Sight3!LAT3_))","v":0.58051615091557052},null,{"$f":"COS(RADIANS(E176))*COS(RADIANS(Sight3!AZ_nord3-180))","v":-0.18415075094111941},null,null,null,null,null,null,null,null,348,{"$f":"COS(RADIANS(Sight3!DEC3_))*COS(RADIANS(T176))","v":0.96654599809814989},{"$f":"COS(RADIANS(Sight3!DEC3_))*SIN(RADIANS(T176))","v":-0.20544569405166302},null,null,null,null,348,{"$f":"COS(RADIANS(Sight3!HC3_))*COS(RADIANS(AA176))","v":0.64337889803651793},{"$f":"COS(RADIANS(Sight3!HC3_))*SIN(RADIANS(AA176))","v":-0.13675440641769035}]
[350,0.98480775301220802,-0.17364817766693039,null,-260,{"$f":"COS(RADIANS(E177))*COS(RADIANS(Sight3!LHA3_))","v":-0.16514953445135336},0.98480775301220802,{"$f":"F177*COS(RADIANS(90-Sight3!LAT3_))-G177*SIN(RADIANS(90-Sight3!LAT3_))","v":-0.79241999587283996},{"$f":"F177*SIN(RADIANS(90-Sight3!LAT3_))+G177*COS(RADIANS(90-Sight3!LAT3_))","v":0.60761108388782792},null,{"$f":"COS(RADIANS(E177))*COS(RADIANS(Sight3!AZ_nord3-180))","v":-0.15380300256877441},null,null,null,null,null,null,null,null,350,{"$f":"COS(RADIANS(Sight3!DEC3_))*COS(RADIANS(T177))","v":0.97312715571340636},{"$f":"COS(RADIANS(Sight3!DEC3_))*SIN(RADIANS(T177))","v":-0.17158857321236123},null,null,null,null,350,{"$f":"COS(RADIANS(Sight3!HC3_))*COS(RADIANS(AA177))","v":0.64775962895117678},{"$f":"COS(RADIANS(Sight3!HC3_))*SIN(RADIANS(AA177))","v":-0.1142174995977966}]
[352,0.99026806874157025,-0.13917310096006588,null,-262,{"$f":"COS(RADIANS(E178))*COS(RADIANS(Sight3!LHA3_))","v":-0.13236172783679739},0.99026806874157025,{"$f":"F178*COS(RADIANS(90-Sight3!LAT3_))-G178*SIN(RADIANS(90-Sight3!LAT3_))","v":-0.77216443851015948},{"$f":"F178*SIN(RADIANS(90-Sight3!LAT3_))+G178*COS(RADIANS(90-Sight3!LAT3_))","v":0.63396573634968001},null,{"$f":"COS(RADIANS(E178))*COS(RADIANS(Sight3!AZ_nord3-180))","v":-0.12326786892933649},null,null,null,null,null,null,null,null,352,{"$f":"COS(RADIANS(Sight3!DEC3_))*COS(RADIANS(T178))","v":0.97852270778817318},{"$f":"COS(RADIANS(Sight3!DEC3_))*SIN(RADIANS(T178))","v":-0.13752239812779457},null,null,null,null,352,{"$f":"COS(RADIANS(Sight3!HC3_))*COS(RADIANS(AA178))","v":0.65135116453768038},{"$f":"COS(RADIANS(Sight3!HC3_))*SIN(RADIANS(AA178))","v":-9.1541436348500593E-2}]
[354,0.99452189536827329,-0.10452846326765342,null,-264,{"$f":"COS(RADIANS(E179))*COS(RADIANS(Sight3!LHA3_))","v":-9.9412658845632607E-2},0.9945218953682734,{"$f":"F179*COS(RADIANS(90-Sight3!LAT3_))-G179*SIN(RADIANS(90-Sight3!LAT3_))","v":-0.75096811772196737},{"$f":"F179*SIN(RADIANS(90-Sight3!LAT3_))+G179*COS(RADIANS(90-Sight3!LAT3_))","v":0.65954799921672602},null,{"$f":"COS(RADIANS(E179))*COS(RADIANS(Sight3!AZ_nord3-180))","v":-9.2582552379566987E-2},null,null,null,null,null,null,null,null,354,{"$f":"COS(RADIANS(Sight3!DEC3_))*COS(RADIANS(T179))","v":0.98272608067336831},{"$f":"COS(RADIANS(Sight3!DEC3_))*SIN(RADIANS(T179))","v":-0.1032886731848098},null,null,null,null,354,{"$f":"COS(RADIANS(Sight3!HC3_))*COS(RADIANS(AA179))","v":0.65414912906315015},{"$f":"COS(RADIANS(Sight3!HC3_))*SIN(RADIANS(AA179))","v":-6.8753843959890662E-2}]
[356,0.9975640502598242,-6.9756473744125636E-2,null,-266,{"$f":"COS(RADIANS(E180))*COS(RADIANS(Sight3!LHA3_))","v":-6.6342470843011425E-2},0.9975640502598242,{"$f":"F180*COS(RADIANS(90-Sight3!LAT3_))-G180*SIN(RADIANS(90-Sight3!LAT3_))","v":-0.72885685796010213},{"$f":"F180*SIN(RADIANS(90-Sight3!LAT3_))+G180*COS(RADIANS(90-Sight3!LAT3_))","v":0.6843267044423067},null,{"$f":"COS(RADIANS(E180))*COS(RADIANS(Sight3!AZ_nord3-180))","v":-6.1784438250972684E-2},null,null,null,null,null,null,null,null,356,{"$f":"COS(RADIANS(Sight3!DEC3_))*COS(RADIANS(T180))","v":0.98573215320661112},{"$f":"COS(RADIANS(Sight3!DEC3_))*SIN(RADIANS(T180))","v":-6.8929106903950627E-2},null,null,null,null,356,{"$f":"COS(RADIANS(Sight3!HC3_))*COS(RADIANS(AA180))","v":0.65615011363880527},{"$f":"COS(RADIANS(Sight3!HC3_))*SIN(RADIANS(AA180))","v":-4.5882485603133946E-2}]
[358,0.99939082701909576,-3.4899496702500823E-2,null,-268,{"$f":"COS(RADIANS(E181))*COS(RADIANS(Sight3!LHA3_))","v":-3.3191454758941433E-2},0.99939082701909576,{"$f":"F181*COS(RADIANS(90-Sight3!LAT3_))-G181*SIN(RADIANS(90-Sight3!LAT3_))","v":-0.7058575983886044},{"$f":"F181*SIN(RADIANS(90-Sight3!LAT3_))+G181*COS(RADIANS(90-Sight3!LAT3_))","v":0.70827166299097311},null,{"$f":"COS(RADIANS(E181))*COS(RADIANS(Sight3!AZ_nord3-180))","v":-3.0911049301531924E-2},null,null,null,null,null,null,null,null,358,{"$f":"COS(RADIANS(Sight3!DEC3_))*COS(RADIANS(T181))","v":0.98753726295156985},{"$f":"COS(RADIANS(Sight3!DEC3_))*SIN(RADIANS(T181))","v":-3.4485561124043093E-2},null,null,null,null,358,{"$f":"COS(RADIANS(Sight3!HC3_))*COS(RADIANS(AA181))","v":0.65735168037316838},{"$f":"COS(RADIANS(Sight3!HC3_))*SIN(RADIANS(AA181))","v":-2.2955226505324347E-2}]
[360,1,-2.45029690981724E-16,null,-270,{"$f":"COS(RADIANS(E182))*COS(RADIANS(Sight3!LHA3_))","v":-1.747781344559015E-16},1,{"$f":"F182*COS(RADIANS(90-Sight3!LAT3_))-G182*SIN(RADIANS(90-Sight3!LAT3_))","v":-0.68199836006249859},{"$f":"F182*SIN(RADIANS(90-Sight3!LAT3_))+G182*COS(RADIANS(90-Sight3!LAT3_))","v":0.73135370161917035},null,{"$f":"COS(RADIANS(E182))*COS(RADIANS(Sight3!AZ_nord3-180))","v":-1.6277007350937967E-16},null,null,null,null,null,null,null,null,360,{"$f":"COS(RADIANS(Sight3!DEC3_))*COS(RADIANS(T182))","v":0.98813921066007604},{"$f":"COS(RADIANS(Sight3!DEC3_))*SIN(RADIANS(T182))","v":-2.4212344543496311E-16},null,null,null,null,360,{"$f":"COS(RADIANS(Sight3!HC3_))*COS(RADIANS(AA182))","v":0.65775236534226078},{"$f":"COS(RADIANS(Sight3!HC3_))*SIN(RADIANS(AA182))","v":-1.6116885882231219E-16}]